geronimo-dev mailing list archives

Site index · List index
Message view « Date » · « Thread »
Top « Date » · « Thread »
From ga...@apache.org
Subject [BUILD] branches/2.1: Failed for Revision: 1090115
Date Fri, 08 Apr 2011 11:28:58 GMT
Geronimo Revision: 1090115 built with tests included
 
See the full build-0200.log file at http://people.apache.org/builds/geronimo/server/binaries/2.1/20110408/build-0200.log
 
 
See the unit test reports at http://people.apache.org/builds/geronimo/server/binaries/2.1/20110408/unit-test-reports
 
Tests run: 0, Failures: 0, Errors: 0, Skipped: 0

Downloading: http://maven.rtp.raleigh.ibm.com/nexus-proxy//org/apache/maven/maven-plugin-api/2.0.1/maven-plugin-api-2.0.1.pom
643b downloaded  (maven-plugin-api-2.0.1.pom)
Downloading: http://maven.rtp.raleigh.ibm.com/nexus-proxy//org/apache/maven/maven/2.0.1/maven-2.0.1.pom
11K downloaded  (maven-2.0.1.pom)
Downloading: http://maven.rtp.raleigh.ibm.com/nexus-proxy//org/apache/maven/maven-artifact/2.0.1/maven-artifact-2.0.1.pom
765b downloaded  (maven-artifact-2.0.1.pom)
[INFO] [war:war {execution: default-war}]
[INFO] Exploding webapp...
[INFO] Assembling webapp test-war-j2ee_1.3 in /home/geronimo/geronimo/2.1/testsupport/test-deployment-j2ee_1.3/test-war-j2ee_1.3/target/test-war-j2ee_1.3-2.1.8-SNAPSHOT
[INFO] Copy webapp webResources to /home/geronimo/geronimo/2.1/testsupport/test-deployment-j2ee_1.3/test-war-j2ee_1.3/target/test-war-j2ee_1.3-2.1.8-SNAPSHOT
[INFO] Copy webapp webResources to /home/geronimo/geronimo/2.1/testsupport/test-deployment-j2ee_1.3/test-war-j2ee_1.3/target/test-war-j2ee_1.3-2.1.8-SNAPSHOT
[INFO] Building jar: /home/geronimo/geronimo/2.1/testsupport/test-deployment-j2ee_1.3/test-war-j2ee_1.3/target/test-war-j2ee_1.3-2.1.8-SNAPSHOT/WEB-INF/lib/test-war-j2ee_1.3-2.1.8-SNAPSHOT.jar
[INFO] Generating war /home/geronimo/geronimo/2.1/testsupport/test-deployment-j2ee_1.3/test-war-j2ee_1.3/target/test-war-j2ee_1.3-2.1.8-SNAPSHOT.war
[INFO] Building war: /home/geronimo/geronimo/2.1/testsupport/test-deployment-j2ee_1.3/test-war-j2ee_1.3/target/test-war-j2ee_1.3-2.1.8-SNAPSHOT.war
[INFO] [ianal:verify-legal-files {execution: default}]
[INFO] Checking legal files in: test-war-j2ee_1.3-2.1.8-SNAPSHOT.war
[INFO] [install:install {execution: default-install}]
[INFO] Installing /home/geronimo/geronimo/2.1/testsupport/test-deployment-j2ee_1.3/test-war-j2ee_1.3/target/test-war-j2ee_1.3-2.1.8-SNAPSHOT.war
to /home/geronimo/.m2/repository/org/apache/geronimo/testsupport/test-war-j2ee_1.3/2.1.8-SNAPSHOT/test-war-j2ee_1.3-2.1.8-SNAPSHOT.war
[INFO] ------------------------------------------------------------------------
[INFO] Building Geronimo Test Support, Test Deployment J2EE 1.3 :: RAR
[INFO]    task-segment: [install]
[INFO] ------------------------------------------------------------------------
Downloading: http://maven.rtp.raleigh.ibm.com/nexus-proxy//org/apache/maven/plugins/maven-rar-plugin/2.2/maven-rar-plugin-2.2.pom
2K downloaded  (maven-rar-plugin-2.2.pom)
Downloading: http://maven.rtp.raleigh.ibm.com/nexus-proxy//org/apache/maven/plugins/maven-rar-plugin/2.2/maven-rar-plugin-2.2.jar
11K downloaded  (maven-rar-plugin-2.2.jar)
[INFO] [genesis:validate-configuration {execution: default}]
Downloading: http://maven.rtp.raleigh.ibm.com/nexus-proxy//org/apache/geronimo/specs/geronimo-j2ee-connector_1.5_spec/2.0.0/geronimo-j2ee-connector_1.5_spec-2.0.0.pom
2K downloaded  (geronimo-j2ee-connector_1.5_spec-2.0.0.pom)
Downloading: http://maven.rtp.raleigh.ibm.com/nexus-proxy//org/apache/geronimo/specs/geronimo-j2ee-connector_1.5_spec/2.0.0/geronimo-j2ee-connector_1.5_spec-2.0.0.jar
36K downloaded  (geronimo-j2ee-connector_1.5_spec-2.0.0.jar)
[INFO] [enforcer:enforce {execution: default}]
[INFO] [remote-resources:process {execution: default}]
Downloading: http://maven.rtp.raleigh.ibm.com/nexus-proxy//org/apache/apache-jar-resource-bundle/1.4/apache-jar-resource-bundle-1.4.jar
12K downloaded  (apache-jar-resource-bundle-1.4.jar)
[INFO] [resources:resources {execution: default-resources}]
[INFO] Using 'UTF-8' encoding to copy filtered resources.
[INFO] skip non existing resourceDirectory /home/geronimo/geronimo/2.1/testsupport/test-deployment-j2ee_1.3/test-rar-j2ee_1.3/src/main/resources
[INFO] skip non existing resourceDirectory /home/geronimo/geronimo/2.1/testsupport/test-deployment-j2ee_1.3/test-rar-j2ee_1.3/src/main/filtered-resources
[INFO] Copying 3 resources
[INFO] [compiler:compile {execution: default-compile}]
[INFO] No sources to compile
[INFO] [resources:testResources {execution: default-testResources}]
[INFO] Using 'UTF-8' encoding to copy filtered resources.
[INFO] skip non existing resourceDirectory /home/geronimo/geronimo/2.1/testsupport/test-deployment-j2ee_1.3/test-rar-j2ee_1.3/src/test/resources
[INFO] skip non existing resourceDirectory /home/geronimo/geronimo/2.1/testsupport/test-deployment-j2ee_1.3/test-rar-j2ee_1.3/src/test/filtered-resources
[INFO] Copying 3 resources
[INFO] [compiler:testCompile {execution: default-testCompile}]
[INFO] No sources to compile
[INFO] [surefire:test {execution: default-test}]
Downloading: http://maven.rtp.raleigh.ibm.com/nexus-proxy//org/apache/maven/surefire/surefire-api/2.4.3/surefire-api-2.4.3.jar
503K downloaded  (surefire-api-2.4.3.jar)
Downloading: http://maven.rtp.raleigh.ibm.com/nexus-proxy//junit/junit/3.8.1/junit-3.8.1.jar
Downloading: http://maven.rtp.raleigh.ibm.com/nexus-proxy//org/apache/maven/surefire/surefire-junit/2.4.3/surefire-junit-2.4.3.jar
14K downloaded  (surefire-junit-2.4.3.jar)
118K downloaded  (junit-3.8.1.jar)
[INFO] Surefire report directory: /home/geronimo/geronimo/2.1/testsupport/test-deployment-j2ee_1.3/test-rar-j2ee_1.3/target/surefire-reports
[INFO] ------------------------------------------------------------------------
[ERROR] BUILD FAILURE
[INFO] ------------------------------------------------------------------------
[INFO] There are test failures.

Please refer to /home/geronimo/geronimo/2.1/testsupport/test-deployment-j2ee_1.3/test-rar-j2ee_1.3/target/surefire-reports
for the individual test results.
[INFO] ------------------------------------------------------------------------
[INFO] Trace
org.apache.maven.BuildFailureException: There are test failures.

Please refer to /home/geronimo/geronimo/2.1/testsupport/test-deployment-j2ee_1.3/test-rar-j2ee_1.3/target/surefire-reports
for the individual test results.
	at org.apache.maven.lifecycle.DefaultLifecycleExecutor.executeGoals(DefaultLifecycleExecutor.java:715)
	at org.apache.maven.lifecycle.DefaultLifecycleExecutor.executeGoalWithLifecycle(DefaultLifecycleExecutor.java:556)
	at org.apache.maven.lifecycle.DefaultLifecycleExecutor.executeGoal(DefaultLifecycleExecutor.java:535)
	at org.apache.maven.lifecycle.DefaultLifecycleExecutor.executeGoalAndHandleFailures(DefaultLifecycleExecutor.java:387)
	at org.apache.maven.lifecycle.DefaultLifecycleExecutor.executeTaskSegments(DefaultLifecycleExecutor.java:348)
	at org.apache.maven.lifecycle.DefaultLifecycleExecutor.execute(DefaultLifecycleExecutor.java:180)
	at org.apache.maven.DefaultMaven.doExecute(DefaultMaven.java:328)
	at org.apache.maven.DefaultMaven.execute(DefaultMaven.java:138)
	at org.apache.maven.cli.MavenCli.main(MavenCli.java:362)
	at org.apache.maven.cli.compat.CompatibleMain.main(CompatibleMain.java:60)
	at sun.reflect.NativeMethodAccessorImpl.invoke0(Native Method)
	at sun.reflect.NativeMethodAccessorImpl.invoke(NativeMethodAccessorImpl.java:39)
	at sun.reflect.DelegatingMethodAccessorImpl.invoke(DelegatingMethodAccessorImpl.java:25)
	at java.lang.reflect.Method.invoke(Method.java:592)
	at org.codehaus.classworlds.Launcher.launchEnhanced(Launcher.java:315)
	at org.codehaus.classworlds.Launcher.launch(Launcher.java:255)
	at org.codehaus.classworlds.Launcher.mainWithExitCode(Launcher.java:430)
	at org.codehaus.classworlds.Launcher.main(Launcher.java:375)
Caused by: org.apache.maven.plugin.MojoFailureException: There are test failures.

Please refer to /home/geronimo/geronimo/2.1/testsupport/test-deployment-j2ee_1.3/test-rar-j2ee_1.3/target/surefire-reports
for the individual test results.
	at org.apache.maven.plugin.surefire.SurefirePlugin.execute(SurefirePlugin.java:575)
	at org.apache.maven.plugin.DefaultPluginManager.executeMojo(DefaultPluginManager.java:490)
	at org.apache.maven.lifecycle.DefaultLifecycleExecutor.executeGoals(DefaultLifecycleExecutor.java:694)
	... 17 more
[INFO] ------------------------------------------------------------------------
[INFO] Total time: 359 minutes 37 seconds
[INFO] Finished at: Fri Apr 08 08:03:20 EDT 2011
[INFO] Final Memory: 161M/517M
[INFO] ------------------------------------------------------------------------

Mime
View raw message