geronimo-dev mailing list archives

Site index · List index
Message view « Date » · « Thread »
Top « Date » · « Thread »
From ga...@apache.org
Subject [BUILD] trunk: Failed for Revision: 1079691
Date Wed, 09 Mar 2011 18:02:28 GMT
Geronimo Revision: 1079691 built with tests included
 
See the full build-0300.log file at http://people.apache.org/builds/geronimo/server/binaries/trunk/20110309/build-0300.log
 
 
See the unit test reports at http://people.apache.org/builds/geronimo/server/binaries/trunk/20110309/unit-test-reports
 
[INFO]    task-segment: [install]
[INFO] ------------------------------------------------------------------------
[INFO] [genesis:validate-configuration {execution: default}]
[INFO] [geronimo-property:set-property {execution: set-property}]
Downloading: file:///home/geronimo/.m2/jtidy.repository/org/apache/bval/org.apache.bval.bundle/0.2-incubating/org.apache.bval.bundle-0.2-incubating.pom
[INFO] Unable to find resource 'org.apache.bval:org.apache.bval.bundle:pom:0.2-incubating'
in repository local (file:///home/geronimo/.m2/jtidy.repository)
Downloading: http://oss.sonatype.org/content/groups/jetty-with-staging/org/apache/bval/org.apache.bval.bundle/0.2-incubating/org.apache.bval.bundle-0.2-incubating.pom
[INFO] Unable to find resource 'org.apache.bval:org.apache.bval.bundle:pom:0.2-incubating'
in repository jetty.oss.sonatype.org (http://oss.sonatype.org/content/groups/jetty-with-staging)
Downloading: http://svn.apache.org/repos/asf/servicemix/m2-repo//org/apache/bval/org.apache.bval.bundle/0.2-incubating/org.apache.bval.bundle-0.2-incubating.pom
[INFO] Unable to find resource 'org.apache.bval:org.apache.bval.bundle:pom:0.2-incubating'
in repository smx.svn (http://svn.apache.org/repos/asf/servicemix/m2-repo/)
Downloading: http://download.java.net/maven/2//org/apache/bval/org.apache.bval.bundle/0.2-incubating/org.apache.bval.bundle-0.2-incubating.pom
[INFO] Unable to find resource 'org.apache.bval:org.apache.bval.bundle:pom:0.2-incubating'
in repository java.net2 (http://download.java.net/maven/2/)
Downloading: http://nexus.openqa.org/content/repositories/releases/org/apache/bval/org.apache.bval.bundle/0.2-incubating/org.apache.bval.bundle-0.2-incubating.pom
[INFO] Unable to find resource 'org.apache.bval:org.apache.bval.bundle:pom:0.2-incubating'
in repository openqa-releases (http://nexus.openqa.org/content/repositories/releases)
Downloading: http://maven.rtp.raleigh.ibm.com/nexus-proxy//org/apache/bval/org.apache.bval.bundle/0.2-incubating/org.apache.bval.bundle-0.2-incubating.pom
4K downloaded  (org.apache.bval.bundle-0.2-incubating.pom)
Downloading: file:///home/geronimo/.m2/jtidy.repository/org/apache/bval/bval-parent/0.2-incubating/bval-parent-0.2-incubating.pom
[INFO] Unable to find resource 'org.apache.bval:bval-parent:pom:0.2-incubating' in repository
local (file:///home/geronimo/.m2/jtidy.repository)
Downloading: http://oss.sonatype.org/content/groups/jetty-with-staging/org/apache/bval/bval-parent/0.2-incubating/bval-parent-0.2-incubating.pom
[INFO] Unable to find resource 'org.apache.bval:bval-parent:pom:0.2-incubating' in repository
jetty.oss.sonatype.org (http://oss.sonatype.org/content/groups/jetty-with-staging)
Downloading: http://svn.apache.org/repos/asf/servicemix/m2-repo//org/apache/bval/bval-parent/0.2-incubating/bval-parent-0.2-incubating.pom
[INFO] Unable to find resource 'org.apache.bval:bval-parent:pom:0.2-incubating' in repository
smx.svn (http://svn.apache.org/repos/asf/servicemix/m2-repo/)
Downloading: http://download.java.net/maven/2//org/apache/bval/bval-parent/0.2-incubating/bval-parent-0.2-incubating.pom
[INFO] Unable to find resource 'org.apache.bval:bval-parent:pom:0.2-incubating' in repository
java.net2 (http://download.java.net/maven/2/)
Downloading: http://nexus.openqa.org/content/repositories/releases/org/apache/bval/bval-parent/0.2-incubating/bval-parent-0.2-incubating.pom
[INFO] Unable to find resource 'org.apache.bval:bval-parent:pom:0.2-incubating' in repository
openqa-releases (http://nexus.openqa.org/content/repositories/releases)
Downloading: http://maven.rtp.raleigh.ibm.com/nexus-proxy//org/apache/bval/bval-parent/0.2-incubating/bval-parent-0.2-incubating.pom
24K downloaded  (bval-parent-0.2-incubating.pom)
Downloading: file:///home/geronimo/.m2/jtidy.repository/org/apache/bval/org.apache.bval.bundle/0.2-incubating/org.apache.bval.bundle-0.2-incubating.jar
[INFO] Unable to find resource 'org.apache.bval:org.apache.bval.bundle:jar:0.2-incubating'
in repository local (file:///home/geronimo/.m2/jtidy.repository)
Downloading: http://oss.sonatype.org/content/groups/jetty-with-staging/org/apache/bval/org.apache.bval.bundle/0.2-incubating/org.apache.bval.bundle-0.2-incubating.jar
[INFO] Unable to find resource 'org.apache.bval:org.apache.bval.bundle:jar:0.2-incubating'
in repository jetty.oss.sonatype.org (http://oss.sonatype.org/content/groups/jetty-with-staging)
Downloading: http://svn.apache.org/repos/asf/servicemix/m2-repo//org/apache/bval/org.apache.bval.bundle/0.2-incubating/org.apache.bval.bundle-0.2-incubating.jar
[INFO] Unable to find resource 'org.apache.bval:org.apache.bval.bundle:jar:0.2-incubating'
in repository smx.svn (http://svn.apache.org/repos/asf/servicemix/m2-repo/)
Downloading: http://download.java.net/maven/2//org/apache/bval/org.apache.bval.bundle/0.2-incubating/org.apache.bval.bundle-0.2-incubating.jar
[INFO] Unable to find resource 'org.apache.bval:org.apache.bval.bundle:jar:0.2-incubating'
in repository java.net2 (http://download.java.net/maven/2/)
Downloading: http://nexus.openqa.org/content/repositories/releases/org/apache/bval/org.apache.bval.bundle/0.2-incubating/org.apache.bval.bundle-0.2-incubating.jar
[INFO] Unable to find resource 'org.apache.bval:org.apache.bval.bundle:jar:0.2-incubating'
in repository openqa-releases (http://nexus.openqa.org/content/repositories/releases)
Downloading: http://maven.rtp.raleigh.ibm.com/nexus-proxy//org/apache/bval/org.apache.bval.bundle/0.2-incubating/org.apache.bval.bundle-0.2-incubating.jar
273K downloaded  (org.apache.bval.bundle-0.2-incubating.jar)
[INFO] [enforcer:enforce {execution: default}]
[INFO] [remote-resources:process {execution: default}]
[INFO] [resources:resources {execution: default-resources}]
[INFO] Using 'UTF-8' encoding to copy filtered resources.
[INFO] skip non existing resourceDirectory /home/geronimo/geronimo/trunk/plugins/bval/geronimo-bval/src/main/resources
[INFO] skip non existing resourceDirectory /home/geronimo/geronimo/trunk/plugins/bval/geronimo-bval/src/main/filtered-resources
[INFO] Copying 3 resources
[INFO] [compiler:compile {execution: default-compile}]
[INFO] Compiling 4 source files to /home/geronimo/geronimo/trunk/plugins/bval/geronimo-bval/target/classes
[INFO] ------------------------------------------------------------------------
[ERROR] BUILD FAILURE
[INFO] ------------------------------------------------------------------------
[INFO] Compilation failure
/home/geronimo/geronimo/trunk/plugins/bval/geronimo-bval/src/main/java/org/apache/geronimo/bval/ValidatorFactoryResourceReference.java:[36,8]
cannot find symbol
symbol  : constructor ResourceReference(java.lang.String,java.lang.String)
location: class org.apache.geronimo.naming.reference.ResourceReference<javax.validation.ValidationException>


[INFO] ------------------------------------------------------------------------
[INFO] Trace
org.apache.maven.BuildFailureException: Compilation failure
/home/geronimo/geronimo/trunk/plugins/bval/geronimo-bval/src/main/java/org/apache/geronimo/bval/ValidatorFactoryResourceReference.java:[36,8]
cannot find symbol
symbol  : constructor ResourceReference(java.lang.String,java.lang.String)
location: class org.apache.geronimo.naming.reference.ResourceReference<javax.validation.ValidationException>


	at org.apache.maven.lifecycle.DefaultLifecycleExecutor.executeGoals(DefaultLifecycleExecutor.java:715)
	at org.apache.maven.lifecycle.DefaultLifecycleExecutor.executeGoalWithLifecycle(DefaultLifecycleExecutor.java:556)
	at org.apache.maven.lifecycle.DefaultLifecycleExecutor.executeGoal(DefaultLifecycleExecutor.java:535)
	at org.apache.maven.lifecycle.DefaultLifecycleExecutor.executeGoalAndHandleFailures(DefaultLifecycleExecutor.java:387)
	at org.apache.maven.lifecycle.DefaultLifecycleExecutor.executeTaskSegments(DefaultLifecycleExecutor.java:348)
	at org.apache.maven.lifecycle.DefaultLifecycleExecutor.execute(DefaultLifecycleExecutor.java:180)
	at org.apache.maven.DefaultMaven.doExecute(DefaultMaven.java:328)
	at org.apache.maven.DefaultMaven.execute(DefaultMaven.java:138)
	at org.apache.maven.cli.MavenCli.main(MavenCli.java:362)
	at org.apache.maven.cli.compat.CompatibleMain.main(CompatibleMain.java:60)
	at sun.reflect.NativeMethodAccessorImpl.invoke0(Native Method)
	at sun.reflect.NativeMethodAccessorImpl.invoke(NativeMethodAccessorImpl.java:39)
	at sun.reflect.DelegatingMethodAccessorImpl.invoke(DelegatingMethodAccessorImpl.java:25)
	at java.lang.reflect.Method.invoke(Method.java:597)
	at org.codehaus.classworlds.Launcher.launchEnhanced(Launcher.java:315)
	at org.codehaus.classworlds.Launcher.launch(Launcher.java:255)
	at org.codehaus.classworlds.Launcher.mainWithExitCode(Launcher.java:430)
	at org.codehaus.classworlds.Launcher.main(Launcher.java:375)
Caused by: org.apache.maven.plugin.CompilationFailureException: Compilation failure
/home/geronimo/geronimo/trunk/plugins/bval/geronimo-bval/src/main/java/org/apache/geronimo/bval/ValidatorFactoryResourceReference.java:[36,8]
cannot find symbol
symbol  : constructor ResourceReference(java.lang.String,java.lang.String)
location: class org.apache.geronimo.naming.reference.ResourceReference<javax.validation.ValidationException>


	at org.apache.maven.plugin.AbstractCompilerMojo.execute(AbstractCompilerMojo.java:516)
	at org.apache.maven.plugin.CompilerMojo.execute(CompilerMojo.java:114)
	at org.apache.maven.plugin.DefaultPluginManager.executeMojo(DefaultPluginManager.java:490)
	at org.apache.maven.lifecycle.DefaultLifecycleExecutor.executeGoals(DefaultLifecycleExecutor.java:694)
	... 17 more
[INFO] ------------------------------------------------------------------------
[INFO] Total time: 585 minutes 35 seconds
[INFO] Finished at: Wed Mar 09 12:46:52 EST 2011
[INFO] Final Memory: 283M/651M
[INFO] ------------------------------------------------------------------------

Mime
View raw message