geronimo-dev mailing list archives

Site index · List index
Message view « Date » · « Thread »
Top « Date » · « Thread »
From ga...@apache.org
Subject [BUILD] trunk: Failed for Revision: 1078470
Date Sun, 06 Mar 2011 17:50:10 GMT
Geronimo Revision: 1078470 built with tests included
 
See the full build-0900.log file at http://people.apache.org/builds/geronimo/server/binaries/trunk/20110306/build-0900.log
 
Download the binaries from http://people.apache.org/builds/geronimo/server/binaries/trunk/20110306
[INFO] BUILD SUCCESSFUL
[INFO] ------------------------------------------------------------------------
[INFO] Total time: 42 minutes 11 seconds
[INFO] Finished at: Sun Mar 06 09:46:35 EST 2011
[INFO] Final Memory: 651M/975M
[INFO] ------------------------------------------------------------------------
 
TESTSUITE RESULTS (Failures only)
=================================
 
Assembly: tomcat
=================================
See full test results and logs at http://people.apache.org/builds/geronimo/server/binaries/trunk/20110306/logs-0900-tomcat/
 
Running TestSuite
Tests run: 3, Failures: 3, Errors: 0, Skipped: 0, Time elapsed: 0.613 sec <<< FAILURE!
--
Running TestSuite
Tests run: 1, Failures: 1, Errors: 0, Skipped: 0, Time elapsed: 60.565 sec <<< FAILURE!
Running TestSuite
Tests run: 1, Failures: 1, Errors: 0, Skipped: 0, Time elapsed: 60.519 sec <<< FAILURE!
Running TestSuite
Tests run: 1, Failures: 1, Errors: 0, Skipped: 0, Time elapsed: 0.841 sec <<< FAILURE!
--
Running TestSuite
Tests run: 1, Failures: 1, Errors: 0, Skipped: 0, Time elapsed: 17.115 sec <<< FAILURE!
--
Running TestSuite
Tests run: 2, Failures: 2, Errors: 0, Skipped: 0, Time elapsed: 9.126 sec <<< FAILURE!
--
Running TestSuite
Tests run: 1, Failures: 1, Errors: 0, Skipped: 0, Time elapsed: 0.852 sec <<< FAILURE!
Running TestSuite
Tests run: 1, Failures: 1, Errors: 0, Skipped: 0, Time elapsed: 1.052 sec <<< FAILURE!
Running TestSuite
Tests run: 7, Failures: 3, Errors: 0, Skipped: 4, Time elapsed: 0.995 sec <<< FAILURE!
 
Assembly: jetty
=================================
See full test results and logs at http://people.apache.org/builds/geronimo/server/binaries/trunk/20110306/logs-0900-jetty/
 
Running TestSuite
Tests run: 3, Failures: 3, Errors: 0, Skipped: 0, Time elapsed: 0.558 sec <<< FAILURE!
--
Running TestSuite
Tests run: 2, Failures: 1, Errors: 0, Skipped: 0, Time elapsed: 5.034 sec <<< FAILURE!
--
Running TestSuite
Tests run: 1, Failures: 1, Errors: 0, Skipped: 0, Time elapsed: 60.511 sec <<< FAILURE!
Running TestSuite
Tests run: 1, Failures: 1, Errors: 0, Skipped: 0, Time elapsed: 60.494 sec <<< FAILURE!
Running TestSuite
Tests run: 1, Failures: 1, Errors: 0, Skipped: 0, Time elapsed: 0.826 sec <<< FAILURE!
--
Running TestSuite
Tests run: 1, Failures: 1, Errors: 0, Skipped: 0, Time elapsed: 13.876 sec <<< FAILURE!
--
Running TestSuite
Tests run: 2, Failures: 2, Errors: 0, Skipped: 0, Time elapsed: 8.013 sec <<< FAILURE!
 
[INFO] No sources to compile
[INFO] [surefire:test {execution: default-test}]
[INFO] Tests are skipped.
[INFO] [jar:jar {execution: default-jar}]
[INFO] Building jar: /home/geronimo/geronimo/trunk/testsuite/javaee6-testsuite/servlet3.0-test/servlet3.0-test-jar/target/servlet3.0-test-jar-3.0-SNAPSHOT.jar
[INFO] [ianal:verify-legal-files {execution: default}]
[WARNING] Skipping verification of legal files in artifacts:
[WARNING]     org.apache.geronimo.testsuite:servlet3.0-test-jar:jar:3.0-SNAPSHOT
[INFO] [install:install {execution: default-install}]
[INFO] Installing /home/geronimo/geronimo/trunk/testsuite/javaee6-testsuite/servlet3.0-test/servlet3.0-test-jar/target/servlet3.0-test-jar-3.0-SNAPSHOT.jar
to /home/geronimo/.m2/repository/org/apache/geronimo/testsuite/servlet3.0-test-jar/3.0-SNAPSHOT/servlet3.0-test-jar-3.0-SNAPSHOT.jar
[INFO] ------------------------------------------------------------------------
[INFO] Building Geronimo TestSuite :: Java EE 6 Testsuite :: servlet3.0-test-war
[INFO]    task-segment: [install]
[INFO] ------------------------------------------------------------------------
[INFO] [genesis:validate-configuration {execution: default}]
[INFO] [geronimo-property:set-property {execution: set-property}]
[INFO] [enforcer:enforce {execution: default}]
[INFO] [remote-resources:process {execution: default}]
[INFO] [resources:resources {execution: default-resources}]
[INFO] Using 'UTF-8' encoding to copy filtered resources.
[INFO] Copying 1 resource
[INFO] skip non existing resourceDirectory /home/geronimo/geronimo/trunk/testsuite/javaee6-testsuite/servlet3.0-test/servlet3.0-test-war/src/main/filtered-resources
[INFO] Copying 3 resources
[INFO] [compiler:compile {execution: default-compile}]
[INFO] Compiling 15 source files to /home/geronimo/geronimo/trunk/testsuite/javaee6-testsuite/servlet3.0-test/servlet3.0-test-war/target/classes
[INFO] [selenium:xvfb {execution: xvfb}]
[INFO] Using existing Xvfb...
Copying 1 file to /home/geronimo/geronimo/trunk/testsuite/javaee6-testsuite/servlet3.0-test/servlet3.0-test-war/target/selenium
[INFO] [resources:testResources {execution: default-testResources}]
[INFO] Using 'UTF-8' encoding to copy filtered resources.
[INFO] Copying 3 resources
[INFO] skip non existing resourceDirectory /home/geronimo/geronimo/trunk/testsuite/javaee6-testsuite/servlet3.0-test/servlet3.0-test-war/src/test/filtered-resources
[INFO] Copying 3 resources
[INFO] [compiler:testCompile {execution: default-testCompile}]
[INFO] Compiling 8 source files to /home/geronimo/geronimo/trunk/testsuite/javaee6-testsuite/servlet3.0-test/servlet3.0-test-war/target/test-classes
[INFO] [surefire:test {execution: default-test}]
[INFO] Tests are skipped.
[INFO] [war:war {execution: default-war}]
[INFO] Packaging webapp
[INFO] Assembling webapp [servlet3.0-test-war] in [/home/geronimo/geronimo/trunk/testsuite/javaee6-testsuite/servlet3.0-test/servlet3.0-test-war/target/servlet3.0-test-war-3.0-SNAPSHOT]
[INFO] Processing war project
[INFO] Copying webapp webResources [/home/geronimo/geronimo/trunk/testsuite/javaee6-testsuite/servlet3.0-test/servlet3.0-test-war/src/main/webapp]
to [/home/geronimo/geronimo/trunk/testsuite/javaee6-testsuite/servlet3.0-test/servlet3.0-test-war/target/servlet3.0-test-war-3.0-SNAPSHOT]
[INFO] Copying webapp webResources [/home/geronimo/geronimo/trunk/testsuite/javaee6-testsuite/servlet3.0-test/servlet3.0-test-war/target/classes]
to [/home/geronimo/geronimo/trunk/testsuite/javaee6-testsuite/servlet3.0-test/servlet3.0-test-war/target/servlet3.0-test-war-3.0-SNAPSHOT]
[INFO] Copying webapp resources [/home/geronimo/geronimo/trunk/testsuite/javaee6-testsuite/servlet3.0-test/servlet3.0-test-war/src/main/webapp]
[INFO] Building jar: /home/geronimo/geronimo/trunk/testsuite/javaee6-testsuite/servlet3.0-test/servlet3.0-test-war/target/servlet3.0-test-war-3.0-SNAPSHOT/WEB-INF/lib/servlet3.0-test-war-3.0-SNAPSHOT.jar
[INFO] Webapp assembled in [336 msecs]
[INFO] Building war: /home/geronimo/geronimo/trunk/testsuite/javaee6-testsuite/servlet3.0-test/servlet3.0-test-war/target/servlet3.0-test-war-3.0-SNAPSHOT.war
[INFO] WEB-INF/web.xml already added, skipping
[INFO] [selenium:start-server {execution: start-selenium}]
Launching Selenium Server
Waiting for Selenium Server...
[INFO] Including display properties from: /home/geronimo/geronimo/trunk/testsuite/javaee6-testsuite/servlet3.0-test/servlet3.0-test-war/target/selenium/display.properties
[INFO] Redirecting output to: /home/geronimo/geronimo/trunk/testsuite/javaee6-testsuite/servlet3.0-test/servlet3.0-test-war/target/selenium/server.log
[INFO] User extensions: /home/geronimo/geronimo/trunk/testsuite/javaee6-testsuite/servlet3.0-test/servlet3.0-test-war/target/selenium/user-extensions.js
Selenium Server started
[INFO] [geronimo:start-server {execution: start-geronimo}]
[INFO] Using assembly configuration: jetty
[INFO] Using assembly artifact: org.apache.geronimo.assemblies:geronimo-jetty8-javaee6:zip:bin:3.0-SNAPSHOT:provided
[INFO] Using geronimoHome: /home/geronimo/geronimo/trunk/testsuite/javaee6-testsuite/servlet3.0-test/servlet3.0-test-war/target/geronimo-jetty8-javaee6-3.0-SNAPSHOT
[INFO] Installing assembly...
[INFO] Expanding: /home/geronimo/.m2/repository/org/apache/geronimo/assemblies/geronimo-jetty8-javaee6/3.0-SNAPSHOT/geronimo-jetty8-javaee6-3.0-SNAPSHOT-bin.zip
into /home/geronimo/geronimo/trunk/testsuite/javaee6-testsuite/servlet3.0-test/servlet3.0-test-war/target
[INFO] Starting Geronimo server...
[INFO] Selected option set: default
[INFO] Redirecting output to: /home/geronimo/geronimo/trunk/testsuite/javaee6-testsuite/servlet3.0-test/servlet3.0-test-war/target/geronimo-logs/org.apache.geronimo.mavenplugins.geronimo.server.StartServerMojo.log
[INFO] Waiting for Geronimo server...
[org.apache.geronimo.mavenplugins.geronimo.ServerProxy] : Initialized with URL: service:jmx:rmi://localhost/jndi/rmi://localhost:1099/JMXConnector,
environment: {jmx.remote.credentials=[Ljava.lang.String;@1657326}
[org.apache.geronimo.mavenplugins.geronimo.ServerProxy] : Connecting to: service:jmx:rmi://localhost/jndi/rmi://localhost:1099/JMXConnector
[org.apache.geronimo.mavenplugins.geronimo.ServerProxy] : Connection failure; ignoring: java.io.IOException:
Failed to retrieve RMIServer stub: javax.naming.ServiceUnavailableException [Root exception
is java.rmi.ConnectException: Connection refused to host: localhost; nested exception is:

	java.net.ConnectException: Connection refused]
[org.apache.geronimo.mavenplugins.geronimo.ServerProxy] : Connecting to: service:jmx:rmi://localhost/jndi/rmi://localhost:1099/JMXConnector
[org.apache.geronimo.mavenplugins.geronimo.ServerProxy] : Connection failure; ignoring: java.io.IOException:
Failed to retrieve RMIServer stub: javax.naming.ServiceUnavailableException [Root exception
is java.rmi.ConnectException: Connection refused to host: localhost; nested exception is:

	java.net.ConnectException: Connection refused]
[org.apache.geronimo.mavenplugins.geronimo.ServerProxy] : Connecting to: service:jmx:rmi://localhost/jndi/rmi://localhost:1099/JMXConnector
[org.apache.geronimo.mavenplugins.geronimo.ServerProxy] : Connection failure; ignoring: java.io.IOException:
Failed to retrieve RMIServer stub: javax.naming.ServiceUnavailableException [Root exception
is java.rmi.ConnectException: Connection refused to host: localhost; nested exception is:

	java.net.ConnectException: Connection refused]
[org.apache.geronimo.mavenplugins.geronimo.ServerProxy] : Connecting to: service:jmx:rmi://localhost/jndi/rmi://localhost:1099/JMXConnector
[org.apache.geronimo.mavenplugins.geronimo.ServerProxy] : Connection failure; ignoring: java.io.IOException:
Failed to retrieve RMIServer stub: javax.naming.NameNotFoundException: JMXConnector
[org.apache.geronimo.mavenplugins.geronimo.ServerProxy] : Connecting to: service:jmx:rmi://localhost/jndi/rmi://localhost:1099/JMXConnector
[org.apache.geronimo.mavenplugins.geronimo.ServerProxy] : Connected
[INFO] Geronimo server started in 0:00:55.216
[INFO] [geronimo:deploy-module {execution: deploy-wars}]
[INFO] Using non-artifact based module archive: /home/geronimo/geronimo/trunk/testsuite/javaee6-testsuite/servlet3.0-test/servlet3.0-test-war/target/servlet3.0-test-war-3.0-SNAPSHOT.war
[INFO] Distributing module artifact: /home/geronimo/geronimo/trunk/testsuite/javaee6-testsuite/servlet3.0-test/servlet3.0-test-war/target/servlet3.0-test-war-3.0-SNAPSHOT.war
[org.apache.geronimo.deployment.plugin.factories.BaseDeploymentFactory] : Parsing URI=deployer:geronimo:jmx://localhost:1099
[org.apache.geronimo.deployment.plugin.factories.BaseDeploymentFactory] : Parsing URI=deployer:geronimo:jmx://localhost:1099
[org.apache.geronimo.deployment.plugin.factories.BaseDeploymentFactory] : Using protocol=jmx,
host=localhost, port=1099
[org.apache.geronimo.deployment.plugin.factories.BaseDeploymentFactory] : Using JMXServiceURL
with host=localhost, port=1099, secure=false
[INFO] Starting modules...
[INFO] Starting module: org.apache.geronimo.testsuite/servlet3.0-test-war/3.0-SNAPSHOT/war
[INFO] Started module(s):
[INFO]     [0] org.apache.geronimo.testsuite/servlet3.0-test-war/3.0-SNAPSHOT/war
[INFO] [failsafe:integration-test {execution: integration-test}]
[INFO] Failsafe report directory: /home/geronimo/geronimo/trunk/testsuite/javaee6-testsuite/servlet3.0-test/servlet3.0-test-war/target/failsafe-reports

-------------------------------------------------------
 T E S T S
-------------------------------------------------------
Running TestSuite
killed.
[INFO] ------------------------------------------------------------------------
[ERROR] BUILD ERROR
 
Samples: trunk
=================================
Log: http://people.apache.org/builds/geronimo/server/binaries/trunk/20110306/samples-0900.log
 
Build status: FAILED
 

Mime
View raw message