geronimo-dev mailing list archives

Site index · List index
Message view « Date » · « Thread »
Top « Date » · « Thread »
From ga...@apache.org
Subject [BUILD] trunk: Failed for Revision: 1078229
Date Sat, 05 Mar 2011 05:51:55 GMT
Geronimo Revision: 1078229 built with tests included
 
See the full build-2100.log file at http://people.apache.org/builds/geronimo/server/binaries/trunk/20110304/build-2100.log
 
Download the binaries from http://people.apache.org/builds/geronimo/server/binaries/trunk/20110304
[INFO] BUILD SUCCESSFUL
[INFO] ------------------------------------------------------------------------
[INFO] Total time: 44 minutes 10 seconds
[INFO] Finished at: Fri Mar 04 21:51:18 EST 2011
[INFO] Final Memory: 666M/1006M
[INFO] ------------------------------------------------------------------------
 
TESTSUITE RESULTS (Failures only)
=================================
 
Assembly: tomcat
=================================
See full test results and logs at http://people.apache.org/builds/geronimo/server/binaries/trunk/20110304/logs-2100-tomcat/
 
Running TestSuite
Tests run: 3, Failures: 3, Errors: 0, Skipped: 0, Time elapsed: 0.564 sec <<< FAILURE!
--
Running TestSuite
Tests run: 1, Failures: 1, Errors: 0, Skipped: 0, Time elapsed: 60.653 sec <<< FAILURE!
Running TestSuite
Tests run: 1, Failures: 1, Errors: 0, Skipped: 0, Time elapsed: 60.546 sec <<< FAILURE!
Running TestSuite
Tests run: 1, Failures: 1, Errors: 0, Skipped: 0, Time elapsed: 0.927 sec <<< FAILURE!
--
Running TestSuite
Tests run: 1, Failures: 1, Errors: 0, Skipped: 0, Time elapsed: 17.355 sec <<< FAILURE!
--
Running TestSuite
Tests run: 2, Failures: 2, Errors: 0, Skipped: 0, Time elapsed: 7.951 sec <<< FAILURE!
--
Running TestSuite
Tests run: 1, Failures: 1, Errors: 0, Skipped: 0, Time elapsed: 0.845 sec <<< FAILURE!
Running TestSuite
Tests run: 1, Failures: 1, Errors: 0, Skipped: 0, Time elapsed: 0.804 sec <<< FAILURE!
Running TestSuite
Tests run: 7, Failures: 3, Errors: 0, Skipped: 4, Time elapsed: 0.964 sec <<< FAILURE!
 
Assembly: jetty
=================================
See full test results and logs at http://people.apache.org/builds/geronimo/server/binaries/trunk/20110304/logs-2100-jetty/
 
Running TestSuite
Tests run: 3, Failures: 3, Errors: 0, Skipped: 0, Time elapsed: 0.592 sec <<< FAILURE!
--
Running TestSuite
Tests run: 2, Failures: 1, Errors: 0, Skipped: 0, Time elapsed: 5.054 sec <<< FAILURE!
--
Running TestSuite
Tests run: 1, Failures: 1, Errors: 0, Skipped: 0, Time elapsed: 60.566 sec <<< FAILURE!
Running TestSuite
Tests run: 1, Failures: 1, Errors: 0, Skipped: 0, Time elapsed: 60.497 sec <<< FAILURE!
Running TestSuite
Tests run: 1, Failures: 1, Errors: 0, Skipped: 0, Time elapsed: 0.877 sec <<< FAILURE!
--
Running TestSuite
Tests run: 1, Failures: 1, Errors: 0, Skipped: 0, Time elapsed: 13.639 sec <<< FAILURE!
--
Running TestSuite
Tests run: 2, Failures: 2, Errors: 0, Skipped: 0, Time elapsed: 8.022 sec <<< FAILURE!
Running TestSuite
Tests run: 14, Failures: 1, Errors: 0, Skipped: 0, Time elapsed: 26.075 sec <<< FAILURE!
Running TestSuite
Tests run: 1, Failures: 1, Errors: 0, Skipped: 0, Time elapsed: 0.815 sec <<< FAILURE!
Running TestSuite
Tests run: 1, Failures: 1, Errors: 0, Skipped: 0, Time elapsed: 0.791 sec <<< FAILURE!
Running TestSuite
Tests run: 7, Failures: 3, Errors: 0, Skipped: 4, Time elapsed: 1.025 sec <<< FAILURE!
 
Samples: trunk
=================================
Log: http://people.apache.org/builds/geronimo/server/binaries/trunk/20110304/samples-2100.log
 
Build status: FAILED
 

Mime
View raw message