geronimo-dev mailing list archives

Site index · List index
Message view « Date » · « Thread »
Top « Date » · « Thread »
From ga...@apache.org
Subject [BUILD] trunk: Failed for Revision: 1076633
Date Thu, 03 Mar 2011 17:53:56 GMT
Geronimo Revision: 1076633 built with tests included
 
See the full build-0900.log file at http://people.apache.org/builds/geronimo/server/binaries/trunk/20110303/build-0900.log
 
Download the binaries from http://people.apache.org/builds/geronimo/server/binaries/trunk/20110303
[INFO] BUILD SUCCESSFUL
[INFO] ------------------------------------------------------------------------
[INFO] Total time: 41 minutes 34 seconds
[INFO] Finished at: Thu Mar 03 09:48:28 EST 2011
[INFO] Final Memory: 572M/998M
[INFO] ------------------------------------------------------------------------
 
TESTSUITE RESULTS (Failures only)
=================================
 
Assembly: tomcat
=================================
See full test results and logs at http://people.apache.org/builds/geronimo/server/binaries/trunk/20110303/logs-0900-tomcat/
 
Running TestSuite
Tests run: 3, Failures: 3, Errors: 0, Skipped: 0, Time elapsed: 0.635 sec <<< FAILURE!
--
Running TestSuite
Tests run: 1, Failures: 1, Errors: 0, Skipped: 0, Time elapsed: 60.521 sec <<< FAILURE!
Running TestSuite
Tests run: 1, Failures: 1, Errors: 0, Skipped: 0, Time elapsed: 60.541 sec <<< FAILURE!
Running TestSuite
Tests run: 1, Failures: 1, Errors: 0, Skipped: 0, Time elapsed: 0.821 sec <<< FAILURE!
--
Running TestSuite
Tests run: 1, Failures: 1, Errors: 0, Skipped: 0, Time elapsed: 16.957 sec <<< FAILURE!
--
Running TestSuite
Tests run: 2, Failures: 2, Errors: 0, Skipped: 0, Time elapsed: 7.799 sec <<< FAILURE!
--
Running TestSuite
Tests run: 1, Failures: 1, Errors: 0, Skipped: 0, Time elapsed: 0.822 sec <<< FAILURE!
Running TestSuite
Tests run: 1, Failures: 1, Errors: 0, Skipped: 0, Time elapsed: 0.827 sec <<< FAILURE!
Running TestSuite
Tests run: 7, Failures: 3, Errors: 0, Skipped: 4, Time elapsed: 0.95 sec <<< FAILURE!
 
Assembly: jetty
=================================
See full test results and logs at http://people.apache.org/builds/geronimo/server/binaries/trunk/20110303/logs-0900-jetty/
 
Running TestSuite
Tests run: 3, Failures: 3, Errors: 0, Skipped: 0, Time elapsed: 0.652 sec <<< FAILURE!
--
Running TestSuite
Tests run: 2, Failures: 1, Errors: 0, Skipped: 0, Time elapsed: 5.104 sec <<< FAILURE!
--
Running TestSuite
Tests run: 1, Failures: 1, Errors: 0, Skipped: 0, Time elapsed: 60.531 sec <<< FAILURE!
Running TestSuite
Tests run: 1, Failures: 1, Errors: 0, Skipped: 0, Time elapsed: 60.51 sec <<< FAILURE!
Running TestSuite
Tests run: 1, Failures: 1, Errors: 0, Skipped: 0, Time elapsed: 0.896 sec <<< FAILURE!
--
Running TestSuite
Tests run: 1, Failures: 1, Errors: 0, Skipped: 0, Time elapsed: 14.052 sec <<< FAILURE!
--
Running TestSuite
Tests run: 2, Failures: 2, Errors: 0, Skipped: 0, Time elapsed: 8.05 sec <<< FAILURE!
--
Running TestSuite
Tests run: 1, Failures: 1, Errors: 0, Skipped: 0, Time elapsed: 0.826 sec <<< FAILURE!
Running TestSuite
Tests run: 1, Failures: 1, Errors: 0, Skipped: 0, Time elapsed: 0.787 sec <<< FAILURE!
Running TestSuite
Tests run: 7, Failures: 3, Errors: 0, Skipped: 4, Time elapsed: 1.052 sec <<< FAILURE!
 
Samples: trunk
=================================
Log: http://people.apache.org/builds/geronimo/server/binaries/trunk/20110303/samples-0900.log
 
Build status: FAILED
 

Mime
View raw message