geronimo-dev mailing list archives

Site index · List index
Message view « Date » · « Thread »
Top « Date » · « Thread »
From ga...@apache.org
Subject [BUILD] trunk: Failed for Revision: 1076362
Date Wed, 02 Mar 2011 23:50:20 GMT
Geronimo Revision: 1076362 built with tests included
 
See the full build-1500.log file at http://people.apache.org/builds/geronimo/server/binaries/trunk/20110302/build-1500.log
 
Download the binaries from http://people.apache.org/builds/geronimo/server/binaries/trunk/20110302
[INFO] BUILD SUCCESSFUL
[INFO] ------------------------------------------------------------------------
[INFO] Total time: 40 minutes 56 seconds
[INFO] Finished at: Wed Mar 02 15:48:03 EST 2011
[INFO] Final Memory: 591M/995M
[INFO] ------------------------------------------------------------------------
 
TESTSUITE RESULTS (Failures only)
=================================
 
Assembly: tomcat
=================================
See full test results and logs at http://people.apache.org/builds/geronimo/server/binaries/trunk/20110302/logs-1500-tomcat/
 
Running TestSuite
Tests run: 3, Failures: 3, Errors: 0, Skipped: 0, Time elapsed: 0.607 sec <<< FAILURE!
--
Running TestSuite
Tests run: 1, Failures: 1, Errors: 0, Skipped: 0, Time elapsed: 60.523 sec <<< FAILURE!
Running TestSuite
Tests run: 1, Failures: 1, Errors: 0, Skipped: 0, Time elapsed: 60.495 sec <<< FAILURE!
Running TestSuite
Tests run: 1, Failures: 1, Errors: 0, Skipped: 0, Time elapsed: 0.843 sec <<< FAILURE!
--
Running TestSuite
Tests run: 1, Failures: 1, Errors: 0, Skipped: 0, Time elapsed: 16.931 sec <<< FAILURE!
--
Running TestSuite
Tests run: 2, Failures: 2, Errors: 0, Skipped: 0, Time elapsed: 7.798 sec <<< FAILURE!
--
Running TestSuite
Tests run: 1, Failures: 1, Errors: 0, Skipped: 0, Time elapsed: 0.823 sec <<< FAILURE!
Running TestSuite
Tests run: 1, Failures: 1, Errors: 0, Skipped: 0, Time elapsed: 0.794 sec <<< FAILURE!
Running TestSuite
Tests run: 7, Failures: 3, Errors: 0, Skipped: 4, Time elapsed: 0.932 sec <<< FAILURE!
 
Assembly: jetty
=================================
See full test results and logs at http://people.apache.org/builds/geronimo/server/binaries/trunk/20110302/logs-1500-jetty/
 
Running TestSuite
Tests run: 3, Failures: 3, Errors: 0, Skipped: 0, Time elapsed: 0.577 sec <<< FAILURE!
--
Running TestSuite
Tests run: 2, Failures: 1, Errors: 0, Skipped: 0, Time elapsed: 5.057 sec <<< FAILURE!
--
Running TestSuite
Tests run: 1, Failures: 1, Errors: 0, Skipped: 0, Time elapsed: 60.52 sec <<< FAILURE!
Running TestSuite
Tests run: 1, Failures: 1, Errors: 0, Skipped: 0, Time elapsed: 60.522 sec <<< FAILURE!
Running TestSuite
Tests run: 1, Failures: 1, Errors: 0, Skipped: 0, Time elapsed: 0.881 sec <<< FAILURE!
--
Running TestSuite
Tests run: 1, Failures: 1, Errors: 0, Skipped: 0, Time elapsed: 14.003 sec <<< FAILURE!
--
Running TestSuite
Tests run: 2, Failures: 2, Errors: 0, Skipped: 0, Time elapsed: 8.077 sec <<< FAILURE!
--
Running TestSuite
Tests run: 1, Failures: 1, Errors: 0, Skipped: 0, Time elapsed: 0.834 sec <<< FAILURE!
Running TestSuite
Tests run: 1, Failures: 1, Errors: 0, Skipped: 0, Time elapsed: 0.774 sec <<< FAILURE!
Running TestSuite
Tests run: 7, Failures: 3, Errors: 0, Skipped: 4, Time elapsed: 0.977 sec <<< FAILURE!
 
Samples: trunk
=================================
Log: http://people.apache.org/builds/geronimo/server/binaries/trunk/20110302/samples-1500.log
 
Build status: FAILED
 

Mime
View raw message