geronimo-dev mailing list archives

Site index · List index
Message view « Date » · « Thread »
Top « Date » · « Thread »
From ga...@apache.org
Subject [BUILD] trunk: Failed for Revision: 1073204
Date Tue, 22 Feb 2011 05:34:58 GMT
Geronimo Revision: 1073204 built with tests included
 
See the full build-2100.log file at http://people.apache.org/builds/geronimo/server/binaries/trunk/20110221/build-2100.log
 
Download the binaries from http://people.apache.org/builds/geronimo/server/binaries/trunk/20110221
[INFO] BUILD SUCCESSFUL
[INFO] ------------------------------------------------------------------------
[INFO] Total time: 40 minutes 24 seconds
[INFO] Finished at: Mon Feb 21 21:47:35 EST 2011
[INFO] Final Memory: 611M/974M
[INFO] ------------------------------------------------------------------------
 
TESTSUITE RESULTS (Failures only)
=================================
 
Assembly: tomcat
=================================
See full test results and logs at http://people.apache.org/builds/geronimo/server/binaries/trunk/20110221/logs-2100-tomcat/
 
Running TestSuite
Tests run: 1, Failures: 1, Errors: 0, Skipped: 0, Time elapsed: 60.541 sec <<< FAILURE!
Running TestSuite
Tests run: 1, Failures: 1, Errors: 0, Skipped: 0, Time elapsed: 60.49 sec <<< FAILURE!
 
Assembly: jetty
=================================
See full test results and logs at http://people.apache.org/builds/geronimo/server/binaries/trunk/20110221/logs-2100-jetty/
 
Running TestSuite
Tests run: 2, Failures: 1, Errors: 0, Skipped: 0, Time elapsed: 1.45 sec <<< FAILURE!
--
Running TestSuite
Tests run: 1, Failures: 1, Errors: 0, Skipped: 0, Time elapsed: 60.517 sec <<< FAILURE!
Running TestSuite
Tests run: 1, Failures: 1, Errors: 0, Skipped: 0, Time elapsed: 60.548 sec <<< FAILURE!
 
Samples: trunk
=================================
Log: http://people.apache.org/builds/geronimo/server/binaries/trunk/20110221/samples-2100.log
 
Build status: FAILED
 

Mime
View raw message