geronimo-dev mailing list archives

Site index · List index
Message view « Date » · « Thread »
Top « Date » · « Thread »
From ga...@apache.org
Subject [BUILD] branches/2.1: Failed for Revision: 1071154
Date Wed, 16 Feb 2011 13:01:26 GMT
Geronimo Revision: 1071154 built with tests included
 
See the full build-0200.log file at http://people.apache.org/builds/geronimo/server/binaries/2.1/20110216/build-0200.log
 
 
See the unit test reports at http://people.apache.org/builds/geronimo/server/binaries/2.1/20110216/unit-test-reports
 
Running org.apache.geronimo.jasper.deployment.SchemaConversionTest
Tests run: 14, Failures: 0, Errors: 0, Skipped: 0, Time elapsed: 4.536 sec

Results :

Tests run: 15, Failures: 0, Errors: 0, Skipped: 0

[INFO] [jar:jar {execution: default-jar}]
[INFO] Building jar: /home/geronimo/geronimo/2.1/plugins/jasper/geronimo-jasper-builder/target/geronimo-jasper-builder-2.1.8-SNAPSHOT.jar
[INFO] [ianal:verify-legal-files {execution: default}]
[INFO] Checking legal files in: geronimo-jasper-builder-2.1.8-SNAPSHOT.jar
[INFO] [install:install {execution: default-install}]
[INFO] Installing /home/geronimo/geronimo/2.1/plugins/jasper/geronimo-jasper-builder/target/geronimo-jasper-builder-2.1.8-SNAPSHOT.jar
to /home/geronimo/.m2/repository/org/apache/geronimo/modules/geronimo-jasper-builder/2.1.8-SNAPSHOT/geronimo-jasper-builder-2.1.8-SNAPSHOT.jar
[INFO] ------------------------------------------------------------------------
[INFO] Building Geronimo Plugins, Jasper :: Deployer
[INFO]    task-segment: [install]
[INFO] ------------------------------------------------------------------------
[INFO] [genesis:validate-configuration {execution: default}]
[INFO] [enforcer:enforce {execution: default}]
[INFO] [remote-resources:process {execution: default}]
[INFO] [resources:resources {execution: default-resources}]
[INFO] Using 'UTF-8' encoding to copy filtered resources.
[INFO] skip non existing resourceDirectory /home/geronimo/geronimo/2.1/plugins/jasper/jasper-deployer/src/main/resources
[INFO] skip non existing resourceDirectory /home/geronimo/geronimo/2.1/plugins/jasper/jasper-deployer/src/main/filtered-resources
[INFO] Copying 3 resources
[INFO] [car:validate-configuration {execution: default-validate-configuration}]
[INFO] [car:prepare-plan {execution: default-prepare-plan}]
[INFO] Generated: /home/geronimo/geronimo/2.1/plugins/jasper/jasper-deployer/target/work/plan.xml
[INFO] [car:package {execution: default-package}]
[INFO] Packaging module configuration: /home/geronimo/geronimo/2.1/plugins/jasper/jasper-deployer/target/work/plan.xml
[INFO] Started deployer: org.apache.geronimo.framework/geronimo-gbean-deployer/2.1.8-SNAPSHOT/car
[INFO] snapshot org.apache.geronimo.configs:jasper:2.1.8-SNAPSHOT: checking for updates from
codehaus.snapshots
[INFO] snapshot org.apache.geronimo.configs:jasper:2.1.8-SNAPSHOT: checking for updates from
apache.snapshots
[INFO] snapshot org.apache.geronimo.modules:geronimo-jasper-builder:2.1.8-SNAPSHOT: checking
for updates from codehaus.snapshots
[INFO] snapshot org.apache.geronimo.modules:geronimo-jasper-builder:2.1.8-SNAPSHOT: checking
for updates from apache.snapshots
[INFO] [car:prepare-metadata {execution: default-prepare-metadata}]
[INFO] [car:archive-car {execution: default-archive-car}]
[INFO] Building jar: /home/geronimo/geronimo/2.1/plugins/jasper/jasper-deployer/target/jasper-deployer-2.1.8-SNAPSHOT.car
[INFO] [ianal:verify-legal-files {execution: default}]
[INFO] Checking legal files in: jasper-deployer-2.1.8-SNAPSHOT.car
[INFO] [install:install {execution: default-install}]
[INFO] Installing /home/geronimo/geronimo/2.1/plugins/jasper/jasper-deployer/target/jasper-deployer-2.1.8-SNAPSHOT.car
to /home/geronimo/.m2/repository/org/apache/geronimo/configs/jasper-deployer/2.1.8-SNAPSHOT/jasper-deployer-2.1.8-SNAPSHOT.car
[INFO] [car:update-pluginlist {execution: default-update-pluginlist}]
[INFO] ------------------------------------------------------------------------
[ERROR] BUILD ERROR
[INFO] ------------------------------------------------------------------------
[INFO] 

Unexpected EOF; was expecting a close tag for element <dependency>
 at [row,col {unknown-source}]: [3274,13]
[INFO] ------------------------------------------------------------------------
[INFO] Trace
org.apache.maven.lifecycle.LifecycleExecutionException
	at org.apache.maven.lifecycle.DefaultLifecycleExecutor.executeGoals(DefaultLifecycleExecutor.java:719)
	at org.apache.maven.lifecycle.DefaultLifecycleExecutor.executeGoalWithLifecycle(DefaultLifecycleExecutor.java:556)
	at org.apache.maven.lifecycle.DefaultLifecycleExecutor.executeGoal(DefaultLifecycleExecutor.java:535)
	at org.apache.maven.lifecycle.DefaultLifecycleExecutor.executeGoalAndHandleFailures(DefaultLifecycleExecutor.java:387)
	at org.apache.maven.lifecycle.DefaultLifecycleExecutor.executeTaskSegments(DefaultLifecycleExecutor.java:348)
	at org.apache.maven.lifecycle.DefaultLifecycleExecutor.execute(DefaultLifecycleExecutor.java:180)
	at org.apache.maven.DefaultMaven.doExecute(DefaultMaven.java:328)
	at org.apache.maven.DefaultMaven.execute(DefaultMaven.java:138)
	at org.apache.maven.cli.MavenCli.main(MavenCli.java:362)
	at org.apache.maven.cli.compat.CompatibleMain.main(CompatibleMain.java:60)
	at sun.reflect.NativeMethodAccessorImpl.invoke0(Native Method)
	at sun.reflect.NativeMethodAccessorImpl.invoke(NativeMethodAccessorImpl.java:39)
	at sun.reflect.DelegatingMethodAccessorImpl.invoke(DelegatingMethodAccessorImpl.java:25)
	at java.lang.reflect.Method.invoke(Method.java:592)
	at org.codehaus.classworlds.Launcher.launchEnhanced(Launcher.java:315)
	at org.codehaus.classworlds.Launcher.launch(Launcher.java:255)
	at org.codehaus.classworlds.Launcher.mainWithExitCode(Launcher.java:430)
	at org.codehaus.classworlds.Launcher.main(Launcher.java:375)
Caused by: org.apache.maven.plugin.MojoExecutionException
	at org.codehaus.mojo.pluginsupport.MojoSupport.execute(MojoSupport.java:137)
	at org.apache.maven.plugin.DefaultPluginManager.executeMojo(DefaultPluginManager.java:490)
	at org.apache.maven.lifecycle.DefaultLifecycleExecutor.executeGoals(DefaultLifecycleExecutor.java:694)
	... 17 more
Caused by: javax.xml.bind.UnmarshalException
 - with linked exception:
[com.ctc.wstx.exc.WstxEOFException: Unexpected EOF; was expecting a close tag for element
<dependency>
 at [row,col {unknown-source}]: [3274,13]]
	at com.sun.xml.bind.v2.runtime.unmarshaller.UnmarshallerImpl.handleStreamException(UnmarshallerImpl.java:396)
	at com.sun.xml.bind.v2.runtime.unmarshaller.UnmarshallerImpl.unmarshal0(UnmarshallerImpl.java:334)
	at com.sun.xml.bind.v2.runtime.unmarshaller.UnmarshallerImpl.unmarshal(UnmarshallerImpl.java:311)
	at org.apache.geronimo.system.plugin.PluginXmlUtil.loadPluginList(PluginXmlUtil.java:137)
	at org.apache.geronimo.mavenplugins.car.UpdatePluginListMojo.doExecute(UpdatePluginListMojo.java:72)
	at org.codehaus.mojo.pluginsupport.MojoSupport.execute(MojoSupport.java:122)
	... 19 more
Caused by: com.ctc.wstx.exc.WstxEOFException: Unexpected EOF; was expecting a close tag for
element <dependency>
 at [row,col {unknown-source}]: [3274,13]
	at com.ctc.wstx.sr.StreamScanner.throwUnexpectedEOF(StreamScanner.java:661)
	at com.ctc.wstx.sr.BasicStreamReader.nextFromTree(BasicStreamReader.java:2730)
	at com.ctc.wstx.sr.BasicStreamReader.next(BasicStreamReader.java:1019)
	at com.sun.xml.bind.v2.runtime.unmarshaller.StAXStreamConnector.bridge(StAXStreamConnector.java:151)
	at com.sun.xml.bind.v2.runtime.unmarshaller.UnmarshallerImpl.unmarshal0(UnmarshallerImpl.java:332)
	... 23 more
[INFO] ------------------------------------------------------------------------
[INFO] Total time: 11 minutes 7 seconds
[INFO] Finished at: Wed Feb 16 08:28:47 EST 2011
[INFO] Final Memory: 224M/558M
[INFO] ------------------------------------------------------------------------

Mime
View raw message