geronimo-dev mailing list archives

Site index · List index
Message view « Date » · « Thread »
Top « Date » · « Thread »
From ga...@apache.org
Subject [BUILD] trunk: Failed for Revision: 1068548
Date Wed, 09 Feb 2011 00:48:37 GMT
Geronimo Revision: 1068548 built with tests included
 
See the full build-1500.log file at http://people.apache.org/builds/geronimo/server/binaries/trunk/20110208/build-1500.log
 
Download the binaries from http://people.apache.org/builds/geronimo/server/binaries/trunk/20110208
[INFO] BUILD SUCCESSFUL
[INFO] ------------------------------------------------------------------------
[INFO] Total time: 54 minutes 35 seconds
[INFO] Finished at: Tue Feb 08 16:01:12 EST 2011
[INFO] Final Memory: 687M/948M
[INFO] ------------------------------------------------------------------------
 
TESTSUITE RESULTS (Failures only)
=================================
 
Assembly: tomcat
=================================
See full test results and logs at http://people.apache.org/builds/geronimo/server/binaries/trunk/20110208/logs-1500-tomcat/
 
Running TestSuite
Tests run: 1, Failures: 1, Errors: 0, Skipped: 0, Time elapsed: 60.514 sec <<< FAILURE!
 
[INFO] Building Geronimo TestSuite :: Aries Testsuite :: JPA WAB
[INFO]    task-segment: [install]
[INFO] ------------------------------------------------------------------------
[INFO] [genesis:validate-configuration {execution: default}]
[INFO] [geronimo-property:set-property {execution: set-property}]
[INFO] snapshot org.apache.geronimo.testsuite:jpa-pu:3.0-SNAPSHOT: checking for updates from
codehaus.snapshots
[INFO] snapshot org.apache.geronimo.testsuite:jpa-pu:3.0-SNAPSHOT: checking for updates from
apache.snapshots
[INFO] [enforcer:enforce {execution: default}]
[INFO] [remote-resources:process {execution: default}]
[INFO] [resources:resources {execution: default-resources}]
[INFO] Using 'UTF-8' encoding to copy filtered resources.
[INFO] Copying 2 resources
[INFO] skip non existing resourceDirectory /home/geronimo/geronimo/trunk/testsuite/aries-testsuite/jpa/jpa-wab/src/main/filtered-resources
[INFO] Copying 3 resources
[INFO] [compiler:compile {execution: default-compile}]
[INFO] Compiling 1 source file to /home/geronimo/geronimo/trunk/testsuite/aries-testsuite/jpa/jpa-wab/target/classes
[INFO] [resources:testResources {execution: default-testResources}]
[INFO] Using 'UTF-8' encoding to copy filtered resources.
[INFO] skip non existing resourceDirectory /home/geronimo/geronimo/trunk/testsuite/aries-testsuite/jpa/jpa-wab/src/test/resources
[INFO] skip non existing resourceDirectory /home/geronimo/geronimo/trunk/testsuite/aries-testsuite/jpa/jpa-wab/src/test/filtered-resources
[INFO] Copying 3 resources
[INFO] [compiler:testCompile {execution: default-testCompile}]
[INFO] No sources to compile
[INFO] [surefire:test {execution: default-test}]
[INFO] Tests are skipped.
[INFO] [bundle:bundle {execution: default-bundle}]
[INFO] [ianal:verify-legal-files {execution: default}]
[WARNING] Skipping verification of legal files in artifacts:
[WARNING]     org.apache.geronimo.testsuite:jpa-wab:bundle:3.0-SNAPSHOT
[INFO] [install:install {execution: default-install}]
[INFO] Installing /home/geronimo/geronimo/trunk/testsuite/aries-testsuite/jpa/jpa-wab/target/jpa-wab-3.0-SNAPSHOT.jar
to /home/geronimo/.m2/repository/org/apache/geronimo/testsuite/jpa-wab/3.0-SNAPSHOT/jpa-wab-3.0-SNAPSHOT.jar
[INFO] [bundle:install {execution: default-install}]
[INFO] Parsing file:/home/geronimo/.m2/repository/repository.xml
[INFO] Installing org/apache/geronimo/testsuite/jpa-wab/3.0-SNAPSHOT/jpa-wab-3.0-SNAPSHOT.jar
[INFO] Writing OBR metadata
[INFO] ------------------------------------------------------------------------
[INFO] Building Geronimo TestSuite :: Aries Testsuite :: JPA EBA
[INFO]    task-segment: [install]
[INFO] ------------------------------------------------------------------------
[INFO] [genesis:validate-configuration {execution: default}]
[INFO] [geronimo-property:set-property {execution: set-property}]
[INFO] snapshot org.apache.geronimo.testsuite:jpa-wab:3.0-SNAPSHOT: checking for updates from
codehaus.snapshots
[INFO] snapshot org.apache.geronimo.testsuite:jpa-wab:3.0-SNAPSHOT: checking for updates from
apache.snapshots
[INFO] [enforcer:enforce {execution: default}]
[INFO] [remote-resources:process {execution: default}]
[INFO] [dependency:copy {execution: copy}]
[INFO] [resources:resources {execution: default-resources}]
[INFO] Using 'UTF-8' encoding to copy filtered resources.
[INFO] skip non existing resourceDirectory /home/geronimo/geronimo/trunk/testsuite/aries-testsuite/jpa/jpa-eba/src/main/resources
[INFO] skip non existing resourceDirectory /home/geronimo/geronimo/trunk/testsuite/aries-testsuite/jpa/jpa-eba/src/main/filtered-resources
[INFO] Copying 3 resources
[INFO] [compiler:compile {execution: default-compile}]
[INFO] No sources to compile
[INFO] [resources:testResources {execution: default-testResources}]
[INFO] Using 'UTF-8' encoding to copy filtered resources.
[INFO] skip non existing resourceDirectory /home/geronimo/geronimo/trunk/testsuite/aries-testsuite/jpa/jpa-eba/src/test/resources
[INFO] Copying 1 resource
[INFO] Copying 3 resources
[INFO] [compiler:testCompile {execution: default-testCompile}]
[INFO] Compiling 1 source file to /home/geronimo/geronimo/trunk/testsuite/aries-testsuite/jpa/jpa-eba/target/test-classes
[INFO] [surefire:test {execution: default-test}]
[INFO] Tests are skipped.
[INFO] [eba:eba {execution: default-eba}]
[INFO] Copying artifact[org.apache.geronimo.testsuite, org.apache.geronimo.testsuite:jpa-pu:jar:3.0-SNAPSHOT,
compile]
[INFO] Copying artifact[org.apache.geronimo.testsuite, org.apache.geronimo.testsuite:jpa-wab:jar:3.0-SNAPSHOT,
compile]
[INFO] Building zip: /home/geronimo/geronimo/trunk/testsuite/aries-testsuite/jpa/jpa-eba/target/jpa-eba-3.0-SNAPSHOT.eba
[INFO] [geronimo:start-server {execution: start-geronimo}]
[INFO] Using assembly configuration: tomcat
[INFO] Using assembly artifact: org.apache.geronimo.assemblies:geronimo-tomcat7-javaee6:zip:bin:3.0-SNAPSHOT:provided
[INFO] Using geronimoHome: /home/geronimo/geronimo/trunk/testsuite/aries-testsuite/jpa/jpa-eba/target/geronimo-tomcat7-javaee6-3.0-SNAPSHOT
[INFO] Installing assembly...
[INFO] Expanding: /home/geronimo/.m2/repository/org/apache/geronimo/assemblies/geronimo-tomcat7-javaee6/3.0-SNAPSHOT/geronimo-tomcat7-javaee6-3.0-SNAPSHOT-bin.zip
into /home/geronimo/geronimo/trunk/testsuite/aries-testsuite/jpa/jpa-eba/target
[INFO] Starting Geronimo server...
[INFO] Selected option set: default
[INFO] Redirecting output to: /home/geronimo/geronimo/trunk/testsuite/aries-testsuite/jpa/jpa-eba/target/geronimo-logs/org.apache.geronimo.mavenplugins.geronimo.server.StartServerMojo.log
[INFO] Waiting for Geronimo server...
[org.apache.geronimo.mavenplugins.geronimo.ServerProxy] : Initialized with URL: service:jmx:rmi://localhost/jndi/rmi://localhost:1099/JMXConnector,
environment: {jmx.remote.credentials=[Ljava.lang.String;@1f47012}
[org.apache.geronimo.mavenplugins.geronimo.ServerProxy] : Connecting to: service:jmx:rmi://localhost/jndi/rmi://localhost:1099/JMXConnector
[org.apache.geronimo.mavenplugins.geronimo.ServerProxy] : Connection failure; ignoring: java.io.IOException:
Failed to retrieve RMIServer stub: javax.naming.ServiceUnavailableException [Root exception
is java.rmi.ConnectException: Connection refused to host: localhost; nested exception is:

	java.net.ConnectException: Connection refused]
[org.apache.geronimo.mavenplugins.geronimo.ServerProxy] : Connecting to: service:jmx:rmi://localhost/jndi/rmi://localhost:1099/JMXConnector
[org.apache.geronimo.mavenplugins.geronimo.ServerProxy] : Connection failure; ignoring: java.io.IOException:
Failed to retrieve RMIServer stub: javax.naming.ServiceUnavailableException [Root exception
is java.rmi.ConnectException: Connection refused to host: localhost; nested exception is:

	java.net.ConnectException: Connection refused]
[org.apache.geronimo.mavenplugins.geronimo.ServerProxy] : Connecting to: service:jmx:rmi://localhost/jndi/rmi://localhost:1099/JMXConnector
[org.apache.geronimo.mavenplugins.geronimo.ServerProxy] : Connection failure; ignoring: java.io.IOException:
Failed to retrieve RMIServer stub: javax.naming.ServiceUnavailableException [Root exception
is java.rmi.ConnectException: Connection refused to host: localhost; nested exception is:

	java.net.ConnectException: Connection refused]
[org.apache.geronimo.mavenplugins.geronimo.ServerProxy] : Connecting to: service:jmx:rmi://localhost/jndi/rmi://localhost:1099/JMXConnector
[org.apache.geronimo.mavenplugins.geronimo.ServerProxy] : Connected
[INFO] Geronimo server started in 0:01:05.368
[INFO] [geronimo:deploy-module {execution: deploy-rar}]
[INFO] Using non-artifact based module archive: /home/geronimo/geronimo/trunk/testsuite/aries-testsuite/jpa/jpa-eba/target/derby.rar
[INFO] Using non-artifact based plan: /home/geronimo/geronimo/trunk/testsuite/aries-testsuite/jpa/jpa-eba/target/test-classes/datasource.xml
[INFO] Distributing module artifact: /home/geronimo/geronimo/trunk/testsuite/aries-testsuite/jpa/jpa-eba/target/derby.rar
with plan /home/geronimo/geronimo/trunk/testsuite/aries-testsuite/jpa/jpa-eba/target/test-classes/datasource.xml
[org.apache.geronimo.deployment.plugin.factories.BaseDeploymentFactory] : Parsing URI=deployer:geronimo:jmx://localhost:1099
[org.apache.geronimo.deployment.plugin.factories.BaseDeploymentFactory] : Parsing URI=deployer:geronimo:jmx://localhost:1099
[org.apache.geronimo.deployment.plugin.factories.BaseDeploymentFactory] : Using protocol=jmx,
host=localhost, port=1099
[org.apache.geronimo.deployment.plugin.factories.BaseDeploymentFactory] : Using JMXServiceURL
with host=localhost, port=1099, secure=false
[INFO] Starting modules...
[INFO] Starting module: org.apache.geronimo.testsuite/jpa-datasource/1.0.0/car
[INFO] ------------------------------------------------------------------------
[ERROR] BUILD ERROR
 
Assembly: jetty
=================================
See full test results and logs at http://people.apache.org/builds/geronimo/server/binaries/trunk/20110208/logs-1500-jetty/
 
Running TestSuite
Tests run: 2, Failures: 1, Errors: 0, Skipped: 0, Time elapsed: 1.462 sec <<< FAILURE!
--
Running TestSuite
Tests run: 1, Failures: 1, Errors: 0, Skipped: 0, Time elapsed: 60.534 sec <<< FAILURE!
 
[INFO] Parsing file:/home/geronimo/.m2/repository/repository.xml
[INFO] Installing org/apache/geronimo/testsuite/jpa-pu/3.0-SNAPSHOT/jpa-pu-3.0-SNAPSHOT.jar
[INFO] Writing OBR metadata
[INFO] ------------------------------------------------------------------------
[INFO] Building Geronimo TestSuite :: Aries Testsuite :: JPA WAB
[INFO]    task-segment: [install]
[INFO] ------------------------------------------------------------------------
[INFO] [genesis:validate-configuration {execution: default}]
[INFO] [geronimo-property:set-property {execution: set-property}]
[INFO] [enforcer:enforce {execution: default}]
[INFO] [remote-resources:process {execution: default}]
[INFO] [resources:resources {execution: default-resources}]
[INFO] Using 'UTF-8' encoding to copy filtered resources.
[INFO] Copying 2 resources
[INFO] skip non existing resourceDirectory /home/geronimo/geronimo/trunk/testsuite/aries-testsuite/jpa/jpa-wab/src/main/filtered-resources
[INFO] Copying 3 resources
[INFO] [compiler:compile {execution: default-compile}]
[INFO] Compiling 1 source file to /home/geronimo/geronimo/trunk/testsuite/aries-testsuite/jpa/jpa-wab/target/classes
[INFO] [resources:testResources {execution: default-testResources}]
[INFO] Using 'UTF-8' encoding to copy filtered resources.
[INFO] skip non existing resourceDirectory /home/geronimo/geronimo/trunk/testsuite/aries-testsuite/jpa/jpa-wab/src/test/resources
[INFO] skip non existing resourceDirectory /home/geronimo/geronimo/trunk/testsuite/aries-testsuite/jpa/jpa-wab/src/test/filtered-resources
[INFO] Copying 3 resources
[INFO] [compiler:testCompile {execution: default-testCompile}]
[INFO] No sources to compile
[INFO] [surefire:test {execution: default-test}]
[INFO] Tests are skipped.
[INFO] [bundle:bundle {execution: default-bundle}]
[INFO] [ianal:verify-legal-files {execution: default}]
[WARNING] Skipping verification of legal files in artifacts:
[WARNING]     org.apache.geronimo.testsuite:jpa-wab:bundle:3.0-SNAPSHOT
[INFO] [install:install {execution: default-install}]
[INFO] Installing /home/geronimo/geronimo/trunk/testsuite/aries-testsuite/jpa/jpa-wab/target/jpa-wab-3.0-SNAPSHOT.jar
to /home/geronimo/.m2/repository/org/apache/geronimo/testsuite/jpa-wab/3.0-SNAPSHOT/jpa-wab-3.0-SNAPSHOT.jar
[INFO] [bundle:install {execution: default-install}]
[INFO] Parsing file:/home/geronimo/.m2/repository/repository.xml
[INFO] Installing org/apache/geronimo/testsuite/jpa-wab/3.0-SNAPSHOT/jpa-wab-3.0-SNAPSHOT.jar
[INFO] Writing OBR metadata
[INFO] ------------------------------------------------------------------------
[INFO] Building Geronimo TestSuite :: Aries Testsuite :: JPA EBA
[INFO]    task-segment: [install]
[INFO] ------------------------------------------------------------------------
[INFO] [genesis:validate-configuration {execution: default}]
[INFO] [geronimo-property:set-property {execution: set-property}]
[INFO] [enforcer:enforce {execution: default}]
[INFO] [remote-resources:process {execution: default}]
[INFO] [dependency:copy {execution: copy}]
[INFO] [resources:resources {execution: default-resources}]
[INFO] Using 'UTF-8' encoding to copy filtered resources.
[INFO] skip non existing resourceDirectory /home/geronimo/geronimo/trunk/testsuite/aries-testsuite/jpa/jpa-eba/src/main/resources
[INFO] skip non existing resourceDirectory /home/geronimo/geronimo/trunk/testsuite/aries-testsuite/jpa/jpa-eba/src/main/filtered-resources
[INFO] Copying 3 resources
[INFO] [compiler:compile {execution: default-compile}]
[INFO] No sources to compile
[INFO] [resources:testResources {execution: default-testResources}]
[INFO] Using 'UTF-8' encoding to copy filtered resources.
[INFO] skip non existing resourceDirectory /home/geronimo/geronimo/trunk/testsuite/aries-testsuite/jpa/jpa-eba/src/test/resources
[INFO] Copying 1 resource
[INFO] Copying 3 resources
[INFO] [compiler:testCompile {execution: default-testCompile}]
[INFO] Compiling 1 source file to /home/geronimo/geronimo/trunk/testsuite/aries-testsuite/jpa/jpa-eba/target/test-classes
[INFO] [surefire:test {execution: default-test}]
[INFO] Tests are skipped.
[INFO] [eba:eba {execution: default-eba}]
[INFO] Copying artifact[org.apache.geronimo.testsuite, org.apache.geronimo.testsuite:jpa-pu:jar:3.0-SNAPSHOT,
compile]
[INFO] Copying artifact[org.apache.geronimo.testsuite, org.apache.geronimo.testsuite:jpa-wab:jar:3.0-SNAPSHOT,
compile]
[INFO] Building zip: /home/geronimo/geronimo/trunk/testsuite/aries-testsuite/jpa/jpa-eba/target/jpa-eba-3.0-SNAPSHOT.eba
[INFO] [geronimo:start-server {execution: start-geronimo}]
[INFO] Using assembly configuration: jetty
[INFO] Using assembly artifact: org.apache.geronimo.assemblies:geronimo-jetty8-javaee6:zip:bin:3.0-SNAPSHOT:provided
[INFO] Using geronimoHome: /home/geronimo/geronimo/trunk/testsuite/aries-testsuite/jpa/jpa-eba/target/geronimo-jetty8-javaee6-3.0-SNAPSHOT
[INFO] Installing assembly...
[INFO] Expanding: /home/geronimo/.m2/repository/org/apache/geronimo/assemblies/geronimo-jetty8-javaee6/3.0-SNAPSHOT/geronimo-jetty8-javaee6-3.0-SNAPSHOT-bin.zip
into /home/geronimo/geronimo/trunk/testsuite/aries-testsuite/jpa/jpa-eba/target
[INFO] Starting Geronimo server...
[INFO] Selected option set: default
[INFO] Redirecting output to: /home/geronimo/geronimo/trunk/testsuite/aries-testsuite/jpa/jpa-eba/target/geronimo-logs/org.apache.geronimo.mavenplugins.geronimo.server.StartServerMojo.log
[INFO] Waiting for Geronimo server...
[org.apache.geronimo.mavenplugins.geronimo.ServerProxy] : Initialized with URL: service:jmx:rmi://localhost/jndi/rmi://localhost:1099/JMXConnector,
environment: {jmx.remote.credentials=[Ljava.lang.String;@d0c14c}
[org.apache.geronimo.mavenplugins.geronimo.ServerProxy] : Connecting to: service:jmx:rmi://localhost/jndi/rmi://localhost:1099/JMXConnector
[org.apache.geronimo.mavenplugins.geronimo.ServerProxy] : Connection failure; ignoring: java.io.IOException:
Failed to retrieve RMIServer stub: javax.naming.ServiceUnavailableException [Root exception
is java.rmi.ConnectException: Connection refused to host: localhost; nested exception is:

	java.net.ConnectException: Connection refused]
[org.apache.geronimo.mavenplugins.geronimo.ServerProxy] : Connecting to: service:jmx:rmi://localhost/jndi/rmi://localhost:1099/JMXConnector
[org.apache.geronimo.mavenplugins.geronimo.ServerProxy] : Connection failure; ignoring: java.io.IOException:
Failed to retrieve RMIServer stub: javax.naming.ServiceUnavailableException [Root exception
is java.rmi.ConnectException: Connection refused to host: localhost; nested exception is:

	java.net.ConnectException: Connection refused]
[org.apache.geronimo.mavenplugins.geronimo.ServerProxy] : Connecting to: service:jmx:rmi://localhost/jndi/rmi://localhost:1099/JMXConnector
[org.apache.geronimo.mavenplugins.geronimo.ServerProxy] : Connection failure; ignoring: java.io.IOException:
Failed to retrieve RMIServer stub: javax.naming.ServiceUnavailableException [Root exception
is java.rmi.ConnectException: Connection refused to host: localhost; nested exception is:

	java.net.ConnectException: Connection refused]
[org.apache.geronimo.mavenplugins.geronimo.ServerProxy] : Connecting to: service:jmx:rmi://localhost/jndi/rmi://localhost:1099/JMXConnector
[org.apache.geronimo.mavenplugins.geronimo.ServerProxy] : Connected
[INFO] Geronimo server started in 0:00:50.286
[INFO] [geronimo:deploy-module {execution: deploy-rar}]
[INFO] Using non-artifact based module archive: /home/geronimo/geronimo/trunk/testsuite/aries-testsuite/jpa/jpa-eba/target/derby.rar
[INFO] Using non-artifact based plan: /home/geronimo/geronimo/trunk/testsuite/aries-testsuite/jpa/jpa-eba/target/test-classes/datasource.xml
[INFO] Distributing module artifact: /home/geronimo/geronimo/trunk/testsuite/aries-testsuite/jpa/jpa-eba/target/derby.rar
with plan /home/geronimo/geronimo/trunk/testsuite/aries-testsuite/jpa/jpa-eba/target/test-classes/datasource.xml
[org.apache.geronimo.deployment.plugin.factories.BaseDeploymentFactory] : Parsing URI=deployer:geronimo:jmx://localhost:1099
[org.apache.geronimo.deployment.plugin.factories.BaseDeploymentFactory] : Parsing URI=deployer:geronimo:jmx://localhost:1099
[org.apache.geronimo.deployment.plugin.factories.BaseDeploymentFactory] : Using protocol=jmx,
host=localhost, port=1099
[org.apache.geronimo.deployment.plugin.factories.BaseDeploymentFactory] : Using JMXServiceURL
with host=localhost, port=1099, secure=false
[INFO] Starting modules...
[INFO] Starting module: org.apache.geronimo.testsuite/jpa-datasource/1.0.0/car
[INFO] ------------------------------------------------------------------------
[ERROR] BUILD ERROR
 
Samples: trunk
=================================
Log: http://people.apache.org/builds/geronimo/server/binaries/trunk/20110208/samples-1500.log
 
Build status: FAILED
 

Mime
View raw message