geronimo-dev mailing list archives

Site index · List index
Message view « Date » · « Thread »
Top « Date » · « Thread »
From ga...@apache.org
Subject [BUILD] branches/2.2: Failed for Revision: 1066712
Date Thu, 03 Feb 2011 01:42:28 GMT
Geronimo Revision: 1066712 built with tests included
 
See the full build-2000.log file at http://people.apache.org/builds/geronimo/server/binaries/2.2/20110202/build-2000.log
 
Download the binaries from http://people.apache.org/builds/geronimo/server/binaries/2.2/20110202
[INFO] BUILD SUCCESSFUL
[INFO] ------------------------------------------------------------------------
[INFO] Total time: 29 minutes 10 seconds
[INFO] Finished at: Wed Feb 02 20:35:54 EST 2011
[INFO] Final Memory: 314M/898M
[INFO] ------------------------------------------------------------------------
 
TESTSUITE RESULTS (Failures only)
=================================
 
Assembly: tomcat
=================================
See full test results and logs at http://people.apache.org/builds/geronimo/server/binaries/2.2/20110202/logs-2000-tomcat/
 
 
[INFO] [WARNING]     org.apache.geronimo.testsuite:shutdown:jar:2.2.2-SNAPSHOT
[INFO] [INFO] [failsafe:verify {execution: verify}]
[INFO] [INFO] Failsafe report directory: /home/geronimo/geronimo/2.2/testsuite/commands-testsuite/shutdown/target/failsafe-reports
[INFO] [WARNING] File encoding has not been set, using platform encoding ANSI_X3.4-1968, i.e.
build is platform dependent!
[INFO] [INFO] [install:install {execution: default-install}]
[INFO] [INFO] Installing /home/geronimo/geronimo/2.2/testsuite/commands-testsuite/shutdown/target/shutdown-2.2.2-SNAPSHOT.jar
to /home/geronimo/.m2/repository/org/apache/geronimo/testsuite/shutdown/2.2.2-SNAPSHOT/shutdown-2.2.2-SNAPSHOT.jar
[INFO] [INFO] ------------------------------------------------------------------------
[INFO] [INFO] BUILD SUCCESSFUL
[INFO] [INFO] ------------------------------------------------------------------------
[INFO] [INFO] Total time: 15 seconds
[INFO] [INFO] Finished at: Wed Feb 02 20:48:44 EST 2011
[INFO] [INFO] Final Memory: 36M/531M
[INFO] [INFO] ------------------------------------------------------------------------
[INFO] Invoking: /home/geronimo/geronimo/2.2/testsuite/commands-testsuite/gshell/pom.xml
[INFO] + Error stacktraces are turned on.
[INFO] [INFO] Scanning for projects...
[INFO] [INFO] ------------------------------------------------------------------------
[INFO] [INFO] Building Geronimo TestSuite :: Commands Testsuite :: GShell
[INFO] [INFO]    task-segment: [install]
[INFO] [INFO] ------------------------------------------------------------------------
[INFO] [INFO] [genesis:validate-configuration {execution: default}]
[INFO] [INFO] [enforcer:enforce {execution: default}]
[INFO] [INFO] Setting property: classpath.resource.loader.class => 'org.codehaus.plexus.velocity.ContextClassLoaderResourceLoader'.
[INFO] [INFO] Setting property: velocimacro.messages.on => 'false'.
[INFO] [INFO] Setting property: resource.loader => 'classpath'.
[INFO] [INFO] Setting property: resource.manager.logwhenfound => 'false'.
[INFO] [INFO] [remote-resources:process {execution: default}]
[INFO] [INFO] [resources:resources {execution: default-resources}]
[INFO] [INFO] Using 'UTF-8' encoding to copy filtered resources.
[INFO] [INFO] skip non existing resourceDirectory /home/geronimo/geronimo/2.2/testsuite/commands-testsuite/gshell/src/main/resources
[INFO] [INFO] skip non existing resourceDirectory /home/geronimo/geronimo/2.2/testsuite/commands-testsuite/gshell/src/main/filtered-resources
[INFO] [INFO] Copying 3 resources
[INFO] [INFO] [compiler:compile {execution: default-compile}]
[INFO] [INFO] No sources to compile
[INFO] [INFO] [resources:testResources {execution: default-testResources}]
[INFO] [INFO] Using 'UTF-8' encoding to copy filtered resources.
[INFO] [INFO] Copying 1 resource
[INFO] [INFO] skip non existing resourceDirectory /home/geronimo/geronimo/2.2/testsuite/commands-testsuite/gshell/src/test/filtered-resources
[INFO] [INFO] Copying 3 resources
[INFO] [INFO] [compiler:testCompile {execution: default-testCompile}]
[INFO] [INFO] Compiling 1 source file to /home/geronimo/geronimo/2.2/testsuite/commands-testsuite/gshell/target/test-classes
[INFO] [INFO] [surefire:test {execution: default-test}]
[INFO] [INFO] Tests are skipped.
[INFO] [INFO] [jar:jar {execution: default-jar}]
[INFO] [INFO] Building jar: /home/geronimo/geronimo/2.2/testsuite/commands-testsuite/gshell/target/gshell-2.2.2-SNAPSHOT.jar
[INFO] [INFO] [failsafe:integration-test {execution: integration-test}]
[INFO] [INFO] Failsafe report directory: /home/geronimo/geronimo/2.2/testsuite/commands-testsuite/gshell/target/failsafe-reports
[INFO] 
[INFO] -------------------------------------------------------
[INFO]  T E S T S
[INFO] -------------------------------------------------------
[INFO] Running TestSuite
[INFO] Tests run: 4, Failures: 0, Errors: 0, Skipped: 0, Time elapsed: 21.233 sec
[INFO] 
[INFO] Results :
[INFO] 
[INFO] Tests run: 4, Failures: 0, Errors: 0, Skipped: 0
[INFO] 
[INFO] [WARNING] File encoding has not been set, using platform encoding ANSI_X3.4-1968, i.e.
build is platform dependent!
[INFO] [INFO] [ianal:verify-legal-files {execution: default}]
[INFO] [WARNING] Skipping verification of legal files in artifacts:
[INFO] [WARNING]     org.apache.geronimo.testsuite:gshell:jar:2.2.2-SNAPSHOT
[INFO] [INFO] [failsafe:verify {execution: verify}]
[INFO] [INFO] Failsafe report directory: /home/geronimo/geronimo/2.2/testsuite/commands-testsuite/gshell/target/failsafe-reports
[INFO] [WARNING] File encoding has not been set, using platform encoding ANSI_X3.4-1968, i.e.
build is platform dependent!
[INFO] [INFO] [install:install {execution: default-install}]
[INFO] [INFO] Installing /home/geronimo/geronimo/2.2/testsuite/commands-testsuite/gshell/target/gshell-2.2.2-SNAPSHOT.jar
to /home/geronimo/.m2/repository/org/apache/geronimo/testsuite/gshell/2.2.2-SNAPSHOT/gshell-2.2.2-SNAPSHOT.jar
[INFO] [INFO] ------------------------------------------------------------------------
[INFO] [INFO] BUILD SUCCESSFUL
[INFO] [INFO] ------------------------------------------------------------------------
[INFO] [INFO] Total time: 34 seconds
[INFO] [INFO] Finished at: Wed Feb 02 20:49:20 EST 2011
[INFO] [INFO] Final Memory: 37M/536M
[INFO] [INFO] ------------------------------------------------------------------------
[INFO] [ianal:verify-legal-files {execution: default}]
[INFO] [install:install {execution: default-install}]
[INFO] Installing /home/geronimo/geronimo/2.2/testsuite/commands-testsuite/pom.xml to /home/geronimo/.m2/repository/org/apache/geronimo/testsuite/commands-testsuite/2.2.2-SNAPSHOT/commands-testsuite-2.2.2-SNAPSHOT.pom
[INFO] [geronimo:stop-server {execution: stop}]
[INFO] Stopping Geronimo server...
[INFO] ------------------------------------------------------------------------
[INFO] Building Geronimo TestSuite :: Concurrent TestSuite
[INFO]    task-segment: [install]
[INFO] ------------------------------------------------------------------------
[INFO] [genesis:validate-configuration {execution: default}]
[INFO] [enforcer:enforce {execution: default}]
[INFO] [remote-resources:process {execution: default}]
[INFO] [site:attach-descriptor {execution: default-attach-descriptor}]
[INFO] [install:install {execution: install-ahead}]
[INFO] Installing /home/geronimo/geronimo/2.2/testsuite/concurrent-testsuite/pom.xml to /home/geronimo/.m2/repository/org/apache/geronimo/testsuite/concurrent-testsuite/2.2.2-SNAPSHOT/concurrent-testsuite-2.2.2-SNAPSHOT.pom
[INFO] [geronimo:start-server {execution: start}]
[INFO] Using assembly configuration: tomcat
[INFO] Using assembly artifact: org.apache.geronimo.assemblies:geronimo-tomcat6-javaee5:zip:bin:2.2.2-SNAPSHOT:provided
[INFO] Using geronimoHome: /home/geronimo/geronimo/2.2/testsuite/concurrent-testsuite/target/geronimo-tomcat6-javaee5-2.2.2-SNAPSHOT
[INFO] Installing assembly...
[INFO] Expanding: /home/geronimo/.m2/repository/org/apache/geronimo/assemblies/geronimo-tomcat6-javaee5/2.2.2-SNAPSHOT/geronimo-tomcat6-javaee5-2.2.2-SNAPSHOT-bin.zip
into /home/geronimo/geronimo/2.2/testsuite/concurrent-testsuite/target
[INFO] Starting Geronimo server...
[INFO] Selected option set: default
[INFO] Redirecting output to: /home/geronimo/geronimo/2.2/testsuite/concurrent-testsuite/target/geronimo-logs/org.apache.geronimo.mavenplugins.geronimo.server.StartServerMojo.log
[INFO] Waiting for Geronimo server...
[INFO] ------------------------------------------------------------------------
[ERROR] BUILD ERROR
 
Assembly: jetty
=================================
See full test results and logs at http://people.apache.org/builds/geronimo/server/binaries/2.2/20110202/logs-2000-jetty/
 
 
Booting Geronimo Kernel (in Java 1.5.0_22)...
Module  1/74 org.apache.geronimo.framework/j2ee-system/2.2.2-SNAPSHOT/car                
                      started in   .000s
Module  2/74 org.apache.geronimo.framework/jee-specs/2.2.2-SNAPSHOT/car                  
                      started in   .001s
Module  3/74 org.apache.geronimo.plugins.classloaders/xbean-finder/2.2.2-SNAPSHOT/car    
                      started in   .000s
Module  4/74 org.apache.geronimo.framework/xmlbeans/2.2.2-SNAPSHOT/car                   
                      started in   .000s
Module  5/74 org.apache.geronimo.framework/rmi-naming/2.2.2-SNAPSHOT/car                 
                     2011-02-02 21:00:14,436 WARN  [RMIRegistryService] RMI Registry failed
2011-02-02 21:00:14,438 ERROR [GBeanInstanceState] Error while starting; GBean is now in the
FAILED state: abstractName="org.apache.geronimo.framework/rmi-naming/2.2.2-SNAPSHOT/car?ServiceModule=org.apache.geronimo.framework/rmi-naming/2.2.2-SNAPSHOT/car,j2eeType=GBean,name=RMIRegistry"
java.rmi.server.ExportException: Port already in use: 1099; nested exception is: 
	java.net.BindException: Address already in use
	at sun.rmi.transport.tcp.TCPTransport.listen(TCPTransport.java:249)
	at sun.rmi.transport.tcp.TCPTransport.exportObject(TCPTransport.java:184)
	at sun.rmi.transport.tcp.TCPEndpoint.exportObject(TCPEndpoint.java:382)
	at sun.rmi.transport.LiveRef.exportObject(LiveRef.java:116)
	at sun.rmi.server.UnicastServerRef.exportObject(UnicastServerRef.java:180)
	at sun.rmi.registry.RegistryImpl.setup(RegistryImpl.java:92)
	at sun.rmi.registry.RegistryImpl.<init>(RegistryImpl.java:68)
	at java.rmi.registry.LocateRegistry.createRegistry(LocateRegistry.java:222)
	at org.apache.geronimo.kernel.rmi.RMIRegistryService.doStart(RMIRegistryService.java:72)
	at org.apache.geronimo.gbean.runtime.GBeanInstance.createInstance(GBeanInstance.java:953)
	at org.apache.geronimo.gbean.runtime.GBeanInstanceState.attemptFullStart(GBeanInstanceState.java:269)
	at org.apache.geronimo.gbean.runtime.GBeanInstanceState.start(GBeanInstanceState.java:103)
	at org.apache.geronimo.gbean.runtime.GBeanInstanceState.startRecursive(GBeanInstanceState.java:125)
	at org.apache.geronimo.gbean.runtime.GBeanInstance.startRecursive(GBeanInstance.java:539)
	at org.apache.geronimo.kernel.basic.BasicKernel.startRecursiveGBean(BasicKernel.java:377)
	at org.apache.geronimo.kernel.config.ConfigurationUtil.startConfigurationGBeans(ConfigurationUtil.java:456)
	at org.apache.geronimo.kernel.config.KernelConfigurationManager.start(KernelConfigurationManager.java:190)
	at org.apache.geronimo.kernel.config.SimpleConfigurationManager.startConfiguration(SimpleConfigurationManager.java:546)
	at sun.reflect.NativeMethodAccessorImpl.invoke0(Native Method)
	at sun.reflect.NativeMethodAccessorImpl.invoke(NativeMethodAccessorImpl.java:39)
	at sun.reflect.DelegatingMethodAccessorImpl.invoke(DelegatingMethodAccessorImpl.java:25)
	at java.lang.reflect.Method.invoke(Method.java:592)
	at org.apache.geronimo.gbean.runtime.ReflectionMethodInvoker.invoke(ReflectionMethodInvoker.java:34)
	at org.apache.geronimo.gbean.runtime.GBeanOperation.invoke(GBeanOperation.java:130)
	at org.apache.geronimo.gbean.runtime.GBeanInstance.invoke(GBeanInstance.java:816)
	at org.apache.geronimo.gbean.runtime.RawInvoker.invoke(RawInvoker.java:57)
	at org.apache.geronimo.kernel.basic.RawOperationInvoker.invoke(RawOperationInvoker.java:35)
	at org.apache.geronimo.kernel.basic.ProxyMethodInterceptor.intercept(ProxyMethodInterceptor.java:96)
	at org.apache.geronimo.kernel.config.EditableConfigurationManager$$EnhancerByCGLIB$$2ee4223f.startConfiguration(<generated>)
	at org.apache.geronimo.system.main.EmbeddedDaemon.doStartup(EmbeddedDaemon.java:204)
	at org.apache.geronimo.system.main.EmbeddedDaemon.execute(EmbeddedDaemon.java:87)
	at org.apache.geronimo.kernel.util.MainConfigurationBootstrapper.main(MainConfigurationBootstrapper.java:45)
	at org.apache.geronimo.cli.AbstractCLI.executeMain(AbstractCLI.java:65)
	at org.apache.geronimo.cli.daemon.DaemonCLI.main(DaemonCLI.java:30)
Caused by: java.net.BindException: Address already in use
	at java.net.PlainSocketImpl.socketBind(Native Method)
	at java.net.PlainSocketImpl.bind(PlainSocketImpl.java:359)
	at java.net.ServerSocket.bind(ServerSocket.java:319)
	at java.net.ServerSocket.<init>(ServerSocket.java:185)
	at org.apache.geronimo.kernel.rmi.GeronimoRMIServerSocketFactory.createServerSocket(GeronimoRMIServerSocketFactory.java:35)
	at sun.rmi.transport.tcp.TCPEndpoint.newServerSocket(TCPEndpoint.java:622)
	at sun.rmi.transport.tcp.TCPTransport.listen(TCPTransport.java:237)
	... 33 more
Server Startup failed

org.apache.geronimo.kernel.config.LifecycleException: start of org.apache.geronimo.framework/rmi-naming/2.2.2-SNAPSHOT/car
failed
	at org.apache.geronimo.kernel.config.SimpleConfigurationManager.startConfiguration(SimpleConfigurationManager.java:562)
	at sun.reflect.NativeMethodAccessorImpl.invoke0(Native Method)
	at sun.reflect.NativeMethodAccessorImpl.invoke(NativeMethodAccessorImpl.java:39)
	at sun.reflect.DelegatingMethodAccessorImpl.invoke(DelegatingMethodAccessorImpl.java:25)
	at java.lang.reflect.Method.invoke(Method.java:592)
	at org.apache.geronimo.gbean.runtime.ReflectionMethodInvoker.invoke(ReflectionMethodInvoker.java:34)
	at org.apache.geronimo.gbean.runtime.GBeanOperation.invoke(GBeanOperation.java:130)
	at org.apache.geronimo.gbean.runtime.GBeanInstance.invoke(GBeanInstance.java:816)
	at org.apache.geronimo.gbean.runtime.RawInvoker.invoke(RawInvoker.java:57)
	at org.apache.geronimo.kernel.basic.RawOperationInvoker.invoke(RawOperationInvoker.java:35)
	at org.apache.geronimo.kernel.basic.ProxyMethodInterceptor.intercept(ProxyMethodInterceptor.java:96)
	at org.apache.geronimo.kernel.config.EditableConfigurationManager$$EnhancerByCGLIB$$2ee4223f.startConfiguration(<generated>)
	at org.apache.geronimo.system.main.EmbeddedDaemon.doStartup(EmbeddedDaemon.java:204)
	at org.apache.geronimo.system.main.EmbeddedDaemon.execute(EmbeddedDaemon.java:87)
	at org.apache.geronimo.kernel.util.MainConfigurationBootstrapper.main(MainConfigurationBootstrapper.java:45)
	at org.apache.geronimo.cli.AbstractCLI.executeMain(AbstractCLI.java:65)
	at org.apache.geronimo.cli.daemon.DaemonCLI.main(DaemonCLI.java:30)
Caused by: org.apache.geronimo.kernel.config.InvalidConfigException: Unknown start exception
	at org.apache.geronimo.kernel.config.ConfigurationUtil.startConfigurationGBeans(ConfigurationUtil.java:522)
	at org.apache.geronimo.kernel.config.KernelConfigurationManager.start(KernelConfigurationManager.java:190)
	at org.apache.geronimo.kernel.config.SimpleConfigurationManager.startConfiguration(SimpleConfigurationManager.java:546)
	... 16 more
Caused by: org.apache.geronimo.gbean.InvalidConfigurationException: Configuration org.apache.geronimo.framework/rmi-naming/2.2.2-SNAPSHOT/car
failed to start due to the following reasons:
  The service ServiceModule=org.apache.geronimo.framework/rmi-naming/2.2.2-SNAPSHOT/car,j2eeType=GBean,name=RMIRegistry
did not start because Port already in use: 1099; nested exception is: 
	java.net.BindException: Address already in use

	at org.apache.geronimo.kernel.config.ConfigurationUtil.startConfigurationGBeans(ConfigurationUtil.java:485)
	... 18 more
 
[INFO] Scanning for projects...
[INFO] Reactor build order: 
[INFO]   Geronimo TestSuite
[INFO]   Geronimo TestSuite :: Commands TestSuite
[INFO]   Geronimo TestSuite :: Concurrent TestSuite
[INFO]   Geronimo TestSuite :: Console Testsuite
[INFO]   Geronimo TestSuite :: CORBA TestSuite
[INFO]   Geronimo TestSuite :: Deployment Testsuite
[INFO]   Geronimo TestSuite :: Enterprise Testsuite
[INFO]   Geronimo TestSuite :: Security Testsuite
[INFO]   Geronimo TestSuite :: Web-tier Testsuite
[INFO]   Geronimo TestSuite :: WebServices TestSuite
[INFO] ------------------------------------------------------------------------
[INFO] Building Geronimo TestSuite
[INFO]    task-segment: [install]
[INFO] ------------------------------------------------------------------------
[INFO] [genesis:validate-configuration {execution: default}]
[INFO] [enforcer:enforce {execution: default}]
[INFO] Setting property: classpath.resource.loader.class => 'org.codehaus.plexus.velocity.ContextClassLoaderResourceLoader'.
[INFO] Setting property: velocimacro.messages.on => 'false'.
[INFO] Setting property: resource.loader => 'classpath'.
[INFO] Setting property: resource.manager.logwhenfound => 'false'.
[INFO] [remote-resources:process {execution: default}]
[INFO] [site:attach-descriptor {execution: default-attach-descriptor}]
[INFO] [ianal:verify-legal-files {execution: default}]
[INFO] [install:install {execution: default-install}]
[INFO] Installing /home/geronimo/geronimo/2.2/testsuite/pom.xml to /home/geronimo/.m2/repository/org/apache/geronimo/testsuite/testsuite/2.2.2-SNAPSHOT/testsuite-2.2.2-SNAPSHOT.pom
[INFO] ------------------------------------------------------------------------
[INFO] Building Geronimo TestSuite :: Commands TestSuite
[INFO]    task-segment: [install]
[INFO] ------------------------------------------------------------------------
[INFO] [genesis:validate-configuration {execution: default}]
[INFO] [enforcer:enforce {execution: default}]
[INFO] [remote-resources:process {execution: default}]
[INFO] [site:attach-descriptor {execution: default-attach-descriptor}]
[INFO] [geronimo:start-server {execution: start}]
[INFO] Using assembly configuration: jetty
[INFO] snapshot org.apache.geronimo.assemblies:geronimo-jetty7-javaee5:2.2.2-SNAPSHOT: checking
for updates from codehaus.snapshots
[INFO] snapshot org.apache.geronimo.assemblies:geronimo-jetty7-javaee5:2.2.2-SNAPSHOT: checking
for updates from apache.snapshots
[INFO] Using assembly artifact: org.apache.geronimo.assemblies:geronimo-jetty7-javaee5:zip:bin:2.2.2-SNAPSHOT:provided
[INFO] Using geronimoHome: /home/geronimo/geronimo/2.2/testsuite/commands-testsuite/target/geronimo-jetty7-javaee5-2.2.2-SNAPSHOT
[INFO] Installing assembly...
[INFO] Expanding: /home/geronimo/.m2/repository/org/apache/geronimo/assemblies/geronimo-jetty7-javaee5/2.2.2-SNAPSHOT/geronimo-jetty7-javaee5-2.2.2-SNAPSHOT-bin.zip
into /home/geronimo/geronimo/2.2/testsuite/commands-testsuite/target
[INFO] Starting Geronimo server...
[INFO] Selected option set: default
[INFO] Redirecting output to: /home/geronimo/geronimo/2.2/testsuite/commands-testsuite/target/geronimo-logs/org.apache.geronimo.mavenplugins.geronimo.server.StartServerMojo.log
[INFO] Waiting for Geronimo server...
[INFO] ------------------------------------------------------------------------
[ERROR] BUILD ERROR
 
Samples: branches/2.2
=================================
Log: http://people.apache.org/builds/geronimo/server/binaries/2.2/20110202/samples-2000.log
 
Build status: OK
 

Mime
View raw message