geronimo-dev mailing list archives

Site index · List index
Message view « Date » · « Thread »
Top « Date » · « Thread »
From ga...@apache.org
Subject [BUILD] branches/2.1: Failed for Revision: 1065919
Date Wed, 02 Feb 2011 00:36:42 GMT
Geronimo Revision: 1065919 built with tests included
 
See the full build-0200.log file at http://people.apache.org/builds/geronimo/server/binaries/2.1/20110201/build-0200.log
 
 
See the unit test reports at http://people.apache.org/builds/geronimo/server/binaries/2.1/20110201/unit-test-reports
 

"Finalizer" daemon prio=1 tid=0x0813e100 nid=0x424b in Object.wait() [0x60d1f000..0x60d1fe20]
	at java.lang.Object.wait(Native Method)
	- waiting on <0x72157f48> (a java.lang.ref.ReferenceQueue$Lock)
	at java.lang.ref.ReferenceQueue.remove(ReferenceQueue.java:120)
	- locked <0x72157f48> (a java.lang.ref.ReferenceQueue$Lock)
	at java.lang.ref.ReferenceQueue.remove(ReferenceQueue.java:136)
	at java.lang.ref.Finalizer$FinalizerThread.run(Finalizer.java:159)

"Reference Handler" daemon prio=1 tid=0x0813ca90 nid=0x424a in Object.wait() [0x60da0000..0x60da0ea0]
	at java.lang.Object.wait(Native Method)
	- waiting on <0x7211a1b8> (a java.lang.ref.Reference$Lock)
	at java.lang.Object.wait(Object.java:474)
	at java.lang.ref.Reference$ReferenceHandler.run(Reference.java:116)
	- locked <0x7211a1b8> (a java.lang.ref.Reference$Lock)

"main" prio=1 tid=0x0805ce08 nid=0x4240 in Object.wait() [0xbfffc000..0xbfffd818]
	at java.lang.Object.wait(Native Method)
	- waiting on <0xae6d8458> (a java.lang.UNIXProcess)
	at java.lang.Object.wait(Object.java:474)
	at java.lang.UNIXProcess.waitFor(UNIXProcess.java:165)
	- locked <0xae6d8458> (a java.lang.UNIXProcess)
	at org.apache.maven.surefire.booter.shade.org.codehaus.plexus.util.cli.CommandLineUtils.executeCommandLine(CommandLineUtils.java:146)
	at org.apache.maven.surefire.booter.shade.org.codehaus.plexus.util.cli.CommandLineUtils.executeCommandLine(CommandLineUtils.java:98)
	at org.apache.maven.surefire.booter.SurefireBooter.fork(SurefireBooter.java:673)
	at org.apache.maven.surefire.booter.SurefireBooter.forkSuites(SurefireBooter.java:479)
	at org.apache.maven.surefire.booter.SurefireBooter.runSuitesForkOnce(SurefireBooter.java:379)
	at org.apache.maven.surefire.booter.SurefireBooter.run(SurefireBooter.java:245)
	at org.apache.maven.plugin.surefire.SurefirePlugin.execute(SurefirePlugin.java:537)
	at org.apache.maven.plugin.DefaultPluginManager.executeMojo(DefaultPluginManager.java:490)
	at org.apache.maven.lifecycle.DefaultLifecycleExecutor.executeGoals(DefaultLifecycleExecutor.java:694)
	at org.apache.maven.lifecycle.DefaultLifecycleExecutor.executeGoalWithLifecycle(DefaultLifecycleExecutor.java:556)
	at org.apache.maven.lifecycle.DefaultLifecycleExecutor.executeGoal(DefaultLifecycleExecutor.java:535)
	at org.apache.maven.lifecycle.DefaultLifecycleExecutor.executeGoalAndHandleFailures(DefaultLifecycleExecutor.java:387)
	at org.apache.maven.lifecycle.DefaultLifecycleExecutor.executeTaskSegments(DefaultLifecycleExecutor.java:348)
	at org.apache.maven.lifecycle.DefaultLifecycleExecutor.execute(DefaultLifecycleExecutor.java:180)
	at org.apache.maven.DefaultMaven.doExecute(DefaultMaven.java:328)
	at org.apache.maven.DefaultMaven.execute(DefaultMaven.java:138)
	at org.apache.maven.cli.MavenCli.main(MavenCli.java:362)
	at org.apache.maven.cli.compat.CompatibleMain.main(CompatibleMain.java:60)
	at sun.reflect.NativeMethodAccessorImpl.invoke0(Native Method)
	at sun.reflect.NativeMethodAccessorImpl.invoke(NativeMethodAccessorImpl.java:39)
	at sun.reflect.DelegatingMethodAccessorImpl.invoke(DelegatingMethodAccessorImpl.java:25)
	at java.lang.reflect.Method.invoke(Method.java:592)
	at org.codehaus.classworlds.Launcher.launchEnhanced(Launcher.java:315)
	at org.codehaus.classworlds.Launcher.launch(Launcher.java:255)
	at org.codehaus.classworlds.Launcher.mainWithExitCode(Launcher.java:430)
	at org.codehaus.classworlds.Launcher.main(Launcher.java:375)

"VM Thread" prio=1 tid=0x0813a560 nid=0x4249 runnable 

"GC task thread#0 (ParallelGC)" prio=1 tid=0x08077580 nid=0x4245 runnable 

"GC task thread#1 (ParallelGC)" prio=1 tid=0x080785d8 nid=0x4246 runnable 

"GC task thread#2 (ParallelGC)" prio=1 tid=0x080791f0 nid=0x4247 runnable 

"GC task thread#3 (ParallelGC)" prio=1 tid=0x08079e10 nid=0x4248 runnable 

"VM Periodic Task Thread" prio=1 tid=0x60a04428 nid=0x4251 waiting on condition 

[INFO] ------------------------------------------------------------------------
[ERROR] BUILD FAILURE
[INFO] ------------------------------------------------------------------------
[INFO] There are test failures.

Please refer to /home/geronimo/geronimo/2.1/framework/modules/geronimo-system/target/surefire-reports
for the individual test results.
[INFO] ------------------------------------------------------------------------
[INFO] Trace
org.apache.maven.BuildFailureException: There are test failures.

Please refer to /home/geronimo/geronimo/2.1/framework/modules/geronimo-system/target/surefire-reports
for the individual test results.
	at org.apache.maven.lifecycle.DefaultLifecycleExecutor.executeGoals(DefaultLifecycleExecutor.java:715)
	at org.apache.maven.lifecycle.DefaultLifecycleExecutor.executeGoalWithLifecycle(DefaultLifecycleExecutor.java:556)
	at org.apache.maven.lifecycle.DefaultLifecycleExecutor.executeGoal(DefaultLifecycleExecutor.java:535)
	at org.apache.maven.lifecycle.DefaultLifecycleExecutor.executeGoalAndHandleFailures(DefaultLifecycleExecutor.java:387)
	at org.apache.maven.lifecycle.DefaultLifecycleExecutor.executeTaskSegments(DefaultLifecycleExecutor.java:348)
	at org.apache.maven.lifecycle.DefaultLifecycleExecutor.execute(DefaultLifecycleExecutor.java:180)
	at org.apache.maven.DefaultMaven.doExecute(DefaultMaven.java:328)
	at org.apache.maven.DefaultMaven.execute(DefaultMaven.java:138)
	at org.apache.maven.cli.MavenCli.main(MavenCli.java:362)
	at org.apache.maven.cli.compat.CompatibleMain.main(CompatibleMain.java:60)
	at sun.reflect.NativeMethodAccessorImpl.invoke0(Native Method)
	at sun.reflect.NativeMethodAccessorImpl.invoke(NativeMethodAccessorImpl.java:39)
	at sun.reflect.DelegatingMethodAccessorImpl.invoke(DelegatingMethodAccessorImpl.java:25)
	at java.lang.reflect.Method.invoke(Method.java:592)
	at org.codehaus.classworlds.Launcher.launchEnhanced(Launcher.java:315)
	at org.codehaus.classworlds.Launcher.launch(Launcher.java:255)
	at org.codehaus.classworlds.Launcher.mainWithExitCode(Launcher.java:430)
	at org.codehaus.classworlds.Launcher.main(Launcher.java:375)
Caused by: org.apache.maven.plugin.MojoFailureException: There are test failures.

Please refer to /home/geronimo/geronimo/2.1/framework/modules/geronimo-system/target/surefire-reports
for the individual test results.
	at org.apache.maven.plugin.surefire.SurefirePlugin.execute(SurefirePlugin.java:575)
	at org.apache.maven.plugin.DefaultPluginManager.executeMojo(DefaultPluginManager.java:490)
	at org.apache.maven.lifecycle.DefaultLifecycleExecutor.executeGoals(DefaultLifecycleExecutor.java:694)
	... 17 more
[INFO] ------------------------------------------------------------------------
[INFO] Total time: 1075 minutes 6 seconds
[INFO] Finished at: Tue Feb 01 20:00:16 EST 2011

Mime
View raw message