geronimo-dev mailing list archives

Site index · List index
Message view « Date » · « Thread »
Top « Date » · « Thread »
From David Jencks <david_jen...@yahoo.com>
Subject Re: [BUILD] trunk: Failed for Revision: 1056864
Date Wed, 12 Jan 2011 03:13:00 GMT
Jean-Louis fixed this problem but I'm now getting a further NPE I suspect from an osgi bundle
url.  Haven't looked into how to fix it.

david jencks

On Jan 8, 2011, at 10:38 PM, David Jencks wrote:

> I'm not sure what to do about this.  We need a new openejb snapshot but as noted on the
openejb dev list rev 1056366 pretty much breaks geronimo deployment completely.  I reverted
it locally in order to keep working on cdi stuff.  No response yet from the patch author....
> 
> david jencks
> 
> On Jan 8, 2011, at 6:48 PM, gawor@apache.org wrote:
> 
>> Geronimo Revision: 1056864 built with tests included
>> 
>> See the full build-2100.log file at http://people.apache.org/builds/geronimo/server/binaries/trunk/20110108/build-2100.log
>> 
>> 
>> See the unit test reports at http://people.apache.org/builds/geronimo/server/binaries/trunk/20110108/unit-test-reports
>> 
>> [INFO] Unable to find resource 'org.codehaus.swizzle:swizzle-stream:jar:1.0.2' in
repository jetty.oss.sonatype.org (http://oss.sonatype.org/content/groups/jetty-with-staging)
>> Downloading: http://svn.apache.org/repos/asf/servicemix/m2-repo//org/codehaus/swizzle/swizzle-stream/1.0.2/swizzle-stream-1.0.2.jar
>> 39K downloaded  (openwebbeans-ejb-1.1.0-20110108.184308-8.jar)
>> [INFO] Unable to find resource 'org.codehaus.swizzle:swizzle-stream:jar:1.0.2' in
repository smx.svn (http://svn.apache.org/repos/asf/servicemix/m2-repo/)
>> Downloading: http://download.java.net/maven/1//org.codehaus.swizzle/jars/swizzle-stream-1.0.2.jar
>> [INFO] Unable to find resource 'org.codehaus.swizzle:swizzle-stream:jar:1.0.2' in
repository java.net (http://download.java.net/maven/1/)
>> Downloading: http://nexus.openqa.org/content/repositories/releases/org/codehaus/swizzle/swizzle-stream/1.0.2/swizzle-stream-1.0.2.jar
>> Downloading: http://repository.apache.org/snapshots//org/apache/openwebbeans/openwebbeans-ee/1.1.0-SNAPSHOT/openwebbeans-ee-1.1.0-20110108.184323-8.jar
>> [INFO] Unable to find resource 'org.codehaus.swizzle:swizzle-stream:jar:1.0.2' in
repository openqa-releases (http://nexus.openqa.org/content/repositories/releases)
>> Downloading: https://repository.jboss.org/nexus/content/groups/public-jboss//org/codehaus/swizzle/swizzle-stream/1.0.2/swizzle-stream-1.0.2.jar
>> 17K downloaded  (openwebbeans-ee-1.1.0-20110108.184323-8.jar)
>> Downloading: http://repository.apache.org/snapshots//org/apache/openwebbeans/openwebbeans-ee-common/1.1.0-SNAPSHOT/openwebbeans-ee-common-1.1.0-20110108.184241-8.jar
>> [INFO] Unable to find resource 'org.codehaus.swizzle:swizzle-stream:jar:1.0.2' in
repository JBoss Repository (https://repository.jboss.org/nexus/content/groups/public-jboss/)
>> Downloading: http://svn.apache.org/repos/asf/openejb/repo//org/codehaus/swizzle/swizzle-stream/1.0.2/swizzle-stream-1.0.2.jar
>> [INFO] snapshot org.apache.geronimo.modules:geronimo-openwebbeans:3.0-SNAPSHOT: checking
for updates from jetty.oss.sonatype.org
>> 11K downloaded  (openwebbeans-ee-common-1.1.0-20110108.184241-8.jar)
>> [INFO] snapshot org.apache.geronimo.modules:geronimo-openwebbeans:3.0-SNAPSHOT: checking
for updates from openqa-snapshots
>> [INFO] Unable to find resource 'org.codehaus.swizzle:swizzle-stream:jar:1.0.2' in
repository openejb-3rdparty-builds (http://svn.apache.org/repos/asf/openejb/repo/)
>> Downloading: http://maven.rtp.raleigh.ibm.com/nexus-proxy//org/codehaus/swizzle/swizzle-stream/1.0.2/swizzle-stream-1.0.2.jar
>> [INFO] snapshot org.apache.geronimo.modules:geronimo-openwebbeans:3.0-SNAPSHOT: checking
for updates from codehaus.snapshots
>> 42K downloaded  (swizzle-stream-1.0.2.jar)
>> [INFO] snapshot org.apache.geronimo.modules:geronimo-openwebbeans:3.0-SNAPSHOT: checking
for updates from apache.snapshots
>> 1829K downloaded  (openejb-core-3.2-20110106.032022-56.jar)
>> Downloading: http://repository.apache.org/snapshots//org/apache/openejb/openejb-api/3.2-SNAPSHOT/openejb-api-3.2-20101222.050455-62.jar
>> 8K downloaded  (openejb-api-3.2-20101222.050455-62.jar)
>> Downloading: http://repository.apache.org/snapshots/org/apache/openejb/openejb-loader/3.2-SNAPSHOT/openejb-loader-3.2-20101222.050504-62.jar
>> 43K downloaded  (openejb-loader-3.2-20101222.050504-62.jar)
>> Downloading: http://repository.apache.org/snapshots/org/apache/openejb/openejb-javaagent/3.2-SNAPSHOT/openejb-javaagent-3.2-20101222.050513-62.jar
>> 12K downloaded  (openejb-javaagent-3.2-20101222.050513-62.jar)
>> Downloading: http://repository.apache.org/snapshots/org/apache/openejb/openejb-ejbd/3.2-SNAPSHOT/openejb-ejbd-3.2-20101222.051747-49.jar
>> 59K downloaded  (openejb-ejbd-3.2-20101222.051747-49.jar)
>> Downloading: http://repository.apache.org/snapshots/org/apache/openejb/openejb-server/3.2-SNAPSHOT/openejb-server-3.2-20101222.051641-51.jar
>> 88K downloaded  (openejb-server-3.2-20101222.051641-51.jar)
>> Downloading: http://repository.apache.org/snapshots/org/apache/openejb/openejb-client/3.2-SNAPSHOT/openejb-client-3.2-20101222.051603-51.jar
>> 229K downloaded  (openejb-client-3.2-20101222.051603-51.jar)
>> Downloading: http://repository.apache.org/snapshots/org/apache/openejb/openejb-multicast/3.2-SNAPSHOT/openejb-multicast-3.2-20101222.051715-51.jar
>> 50K downloaded  (openejb-multicast-3.2-20101222.051715-51.jar)
>> [INFO] [enforcer:enforce {execution: default}]
>> [INFO] [remote-resources:process {execution: default}]
>> [INFO] [resources:resources {execution: default-resources}]
>> [INFO] Using 'UTF-8' encoding to copy filtered resources.
>> [INFO] Copying 1 resource
>> [INFO] skip non existing resourceDirectory /home/geronimo/geronimo/trunk/plugins/openejb/geronimo-openejb/src/main/filtered-resources
>> [INFO] Copying 3 resources
>> [INFO] [compiler:compile {execution: default-compile}]
>> [INFO] Compiling 35 source files to /home/geronimo/geronimo/trunk/plugins/openejb/geronimo-openejb/target/classes
>> [INFO] ------------------------------------------------------------------------
>> [ERROR] BUILD FAILURE
>> [INFO] ------------------------------------------------------------------------
>> [INFO] Compilation failure
>> 
>> /home/geronimo/geronimo/trunk/plugins/openejb/geronimo-openejb/src/main/java/org/apache/geronimo/openejb/EjbModuleImpl.java:[179,47]
cannot find symbol
>> symbol  : method getWebBeansContext()
>> location: class org.apache.openejb.cdi.OWBContext
>> 
>> /home/geronimo/geronimo/trunk/plugins/openejb/geronimo-openejb/src/main/java/org/apache/geronimo/openejb/GeronimoSecurityService.java:[53,45]
[deprecation] login(java.lang.String,javax.security.auth.callback.CallbackHandler) in org.apache.geronimo.security.ContextManager
has been deprecated
>> 
>> /home/geronimo/geronimo/trunk/plugins/openejb/geronimo-openejb/src/main/java/org/apache/geronimo/openejb/ThreadSingletonServiceAdapter.java:[40,7]
org.apache.webbeans.spi.SingletonService cannot be inherited with different arguments: <>
and <org.apache.webbeans.config.WebBeansContext>
>> 
>> /home/geronimo/geronimo/trunk/plugins/openejb/geronimo-openejb/src/main/java/org/apache/geronimo/openejb/ThreadSingletonServiceAdapter.java:[55,64]
cannot find symbol
>> symbol  : method getWebBeansContext()
>> location: class org.apache.openejb.cdi.OWBContext
>> 
>> /home/geronimo/geronimo/trunk/plugins/openejb/geronimo-openejb/src/main/java/org/apache/geronimo/openejb/ThreadSingletonServiceAdapter.java:[87,65]
cannot find symbol
>> symbol  : method getWebBeansContext()
>> location: class org.apache.openejb.cdi.OWBContext
>> 
>> 
>> [INFO] ------------------------------------------------------------------------
>> [INFO] Trace
>> org.apache.maven.BuildFailureException: Compilation failure
>> 	at org.apache.maven.lifecycle.DefaultLifecycleExecutor.executeGoals(DefaultLifecycleExecutor.java:715)
>> 	at org.apache.maven.lifecycle.DefaultLifecycleExecutor.executeGoalWithLifecycle(DefaultLifecycleExecutor.java:556)
>> 	at org.apache.maven.lifecycle.DefaultLifecycleExecutor.executeGoal(DefaultLifecycleExecutor.java:535)
>> 	at org.apache.maven.lifecycle.DefaultLifecycleExecutor.executeGoalAndHandleFailures(DefaultLifecycleExecutor.java:387)
>> 	at org.apache.maven.lifecycle.DefaultLifecycleExecutor.executeTaskSegments(DefaultLifecycleExecutor.java:348)
>> 	at org.apache.maven.lifecycle.DefaultLifecycleExecutor.execute(DefaultLifecycleExecutor.java:180)
>> 	at org.apache.maven.DefaultMaven.doExecute(DefaultMaven.java:328)
>> 	at org.apache.maven.DefaultMaven.execute(DefaultMaven.java:138)
>> 	at org.apache.maven.cli.MavenCli.main(MavenCli.java:362)
>> 	at org.apache.maven.cli.compat.CompatibleMain.main(CompatibleMain.java:60)
>> 	at sun.reflect.NativeMethodAccessorImpl.invoke0(Native Method)
>> 	at sun.reflect.NativeMethodAccessorImpl.invoke(NativeMethodAccessorImpl.java:39)
>> 	at sun.reflect.DelegatingMethodAccessorImpl.invoke(DelegatingMethodAccessorImpl.java:25)
>> 	at java.lang.reflect.Method.invoke(Method.java:597)
>> 	at org.codehaus.classworlds.Launcher.launchEnhanced(Launcher.java:315)
>> 	at org.codehaus.classworlds.Launcher.launch(Launcher.java:255)
>> 	at org.codehaus.classworlds.Launcher.mainWithExitCode(Launcher.java:430)
>> 	at org.codehaus.classworlds.Launcher.main(Launcher.java:375)
>> Caused by: org.apache.maven.plugin.CompilationFailureException: Compilation failure
>> 	at org.apache.maven.plugin.AbstractCompilerMojo.execute(AbstractCompilerMojo.java:516)
>> 	at org.apache.maven.plugin.CompilerMojo.execute(CompilerMojo.java:114)
>> 	at org.apache.maven.plugin.DefaultPluginManager.executeMojo(DefaultPluginManager.java:490)
>> 	at org.apache.maven.lifecycle.DefaultLifecycleExecutor.executeGoals(DefaultLifecycleExecutor.java:694)
>> 	... 17 more
>> [INFO] ------------------------------------------------------------------------
>> [INFO] Total time: 33 minutes 1 second
>> [INFO] Finished at: Sat Jan 08 21:34:31 EST 2011
>> [INFO] Final Memory: 397M/935M
>> [INFO] ------------------------------------------------------------------------
> 


Mime
View raw message