geronimo-dev mailing list archives

Site index · List index
Message view « Date » · « Thread »
Top « Date » · « Thread »
From ga...@apache.org
Subject [BUILD] trunk: Failed for Revision: 1059799
Date Mon, 17 Jan 2011 08:40:24 GMT
Geronimo Revision: 1059799 built with tests included
 
See the full build-0300.log file at http://people.apache.org/builds/geronimo/server/binaries/trunk/20110117/build-0300.log
 
 
See the unit test reports at http://people.apache.org/builds/geronimo/server/binaries/trunk/20110117/unit-test-reports
 
[INFO] [remote-resources:process {execution: default}]
[INFO] [resources:resources {execution: default-resources}]
[INFO] Using 'UTF-8' encoding to copy filtered resources.
[INFO] skip non existing resourceDirectory /home/geronimo/geronimo/trunk/plugins/connector-1_6/geronimo-connector-builder-1_6/src/main/resources
[INFO] skip non existing resourceDirectory /home/geronimo/geronimo/trunk/plugins/connector-1_6/geronimo-connector-builder-1_6/src/main/filtered-resources
[INFO] Copying 130 resources
[INFO] Copying 3 resources
[INFO] [compiler:compile {execution: default-compile}]
[INFO] Compiling 32 source files to /home/geronimo/geronimo/trunk/plugins/connector-1_6/geronimo-connector-builder-1_6/target/classes
[INFO] [resources:testResources {execution: default-testResources}]
[INFO] Using 'UTF-8' encoding to copy filtered resources.
[INFO] Copying 37 resources
[INFO] skip non existing resourceDirectory /home/geronimo/geronimo/trunk/plugins/connector-1_6/geronimo-connector-builder-1_6/src/test/filtered-resources
[INFO] Copying 3 resources
[INFO] [antrun:run {execution: default}]
[INFO] Executing tasks

default:
    [mkdir] Created dir: /home/geronimo/geronimo/trunk/plugins/connector-1_6/geronimo-connector-builder-1_6/target/test-rar-10/META-INF
     [copy] Copying 2 files to /home/geronimo/geronimo/trunk/plugins/connector-1_6/geronimo-connector-builder-1_6/target/test-rar-10/META-INF
      [jar] Building jar: /home/geronimo/geronimo/trunk/plugins/connector-1_6/geronimo-connector-builder-1_6/target/test-rar-10.rar
    [mkdir] Created dir: /home/geronimo/geronimo/trunk/plugins/connector-1_6/geronimo-connector-builder-1_6/target/test-rar-16/META-INF
     [copy] Copying 2 files to /home/geronimo/geronimo/trunk/plugins/connector-1_6/geronimo-connector-builder-1_6/target/test-rar-16/META-INF
      [jar] Building jar: /home/geronimo/geronimo/trunk/plugins/connector-1_6/geronimo-connector-builder-1_6/target/test-rar-16.rar
    [mkdir] Created dir: /home/geronimo/geronimo/trunk/plugins/connector-1_6/geronimo-connector-builder-1_6/target/test-rar-15/META-INF
     [copy] Copying 2 files to /home/geronimo/geronimo/trunk/plugins/connector-1_6/geronimo-connector-builder-1_6/target/test-rar-15/META-INF
      [jar] Building jar: /home/geronimo/geronimo/trunk/plugins/connector-1_6/geronimo-connector-builder-1_6/target/test-rar-15.rar
    [mkdir] Created dir: /home/geronimo/geronimo/trunk/plugins/connector-1_6/geronimo-connector-builder-1_6/target/test-rar-15-notx/META-INF
     [copy] Copying 2 files to /home/geronimo/geronimo/trunk/plugins/connector-1_6/geronimo-connector-builder-1_6/target/test-rar-15-notx/META-INF
      [jar] Building jar: /home/geronimo/geronimo/trunk/plugins/connector-1_6/geronimo-connector-builder-1_6/target/test-rar-15-notx.rar
    [mkdir] Created dir: /home/geronimo/geronimo/trunk/plugins/connector-1_6/geronimo-connector-builder-1_6/target/test-rar-15-localtx/META-INF
     [copy] Copying 2 files to /home/geronimo/geronimo/trunk/plugins/connector-1_6/geronimo-connector-builder-1_6/target/test-rar-15-localtx/META-INF
      [jar] Building jar: /home/geronimo/geronimo/trunk/plugins/connector-1_6/geronimo-connector-builder-1_6/target/test-rar-15-localtx.rar
      [jar] Building jar: /home/geronimo/geronimo/trunk/plugins/connector-1_6/geronimo-connector-builder-1_6/target/test-ear.ear
    [mkdir] Created dir: /home/geronimo/geronimo/trunk/plugins/connector-1_6/geronimo-connector-builder-1_6/target/test-rar-10-noger/META-INF
     [copy] Copying 1 file to /home/geronimo/geronimo/trunk/plugins/connector-1_6/geronimo-connector-builder-1_6/target/test-rar-10-noger/META-INF
      [jar] Building jar: /home/geronimo/geronimo/trunk/plugins/connector-1_6/geronimo-connector-builder-1_6/target/test-rar-10-noger.rar
    [mkdir] Created dir: /home/geronimo/geronimo/trunk/plugins/connector-1_6/geronimo-connector-builder-1_6/target/test-rar-15-noger/META-INF
     [copy] Copying 1 file to /home/geronimo/geronimo/trunk/plugins/connector-1_6/geronimo-connector-builder-1_6/target/test-rar-15-noger/META-INF
      [jar] Building jar: /home/geronimo/geronimo/trunk/plugins/connector-1_6/geronimo-connector-builder-1_6/target/test-rar-15-noger.rar
      [jar] Building jar: /home/geronimo/geronimo/trunk/plugins/connector-1_6/geronimo-connector-builder-1_6/target/test-ear-noger.ear
    [mkdir] Created dir: /home/geronimo/geronimo/trunk/plugins/connector-1_6/geronimo-connector-builder-1_6/target/test-cf-validation/META-INF
     [copy] Copying 2 files to /home/geronimo/geronimo/trunk/plugins/connector-1_6/geronimo-connector-builder-1_6/target/test-cf-validation/META-INF
      [jar] Building jar: /home/geronimo/geronimo/trunk/plugins/connector-1_6/geronimo-connector-builder-1_6/target/test-cf-validation.rar
    [mkdir] Created dir: /home/geronimo/geronimo/trunk/plugins/connector-1_6/geronimo-connector-builder-1_6/target/test-ra-validation/META-INF
     [copy] Copying 2 files to /home/geronimo/geronimo/trunk/plugins/connector-1_6/geronimo-connector-builder-1_6/target/test-ra-validation/META-INF
      [jar] Building jar: /home/geronimo/geronimo/trunk/plugins/connector-1_6/geronimo-connector-builder-1_6/target/test-ra-validation.rar
    [mkdir] Created dir: /home/geronimo/geronimo/trunk/plugins/connector-1_6/geronimo-connector-builder-1_6/target/test-ao-validation/META-INF
     [copy] Copying 2 files to /home/geronimo/geronimo/trunk/plugins/connector-1_6/geronimo-connector-builder-1_6/target/test-ao-validation/META-INF
      [jar] Building jar: /home/geronimo/geronimo/trunk/plugins/connector-1_6/geronimo-connector-builder-1_6/target/test-ao-validation.rar
    [mkdir] Created dir: /home/geronimo/geronimo/trunk/plugins/connector-1_6/geronimo-connector-builder-1_6/target/test-asb-validation/META-INF
     [copy] Copying 2 files to /home/geronimo/geronimo/trunk/plugins/connector-1_6/geronimo-connector-builder-1_6/target/test-asb-validation/META-INF
      [jar] Building jar: /home/geronimo/geronimo/trunk/plugins/connector-1_6/geronimo-connector-builder-1_6/target/test-asb-validation.rar
[INFO] Executed tasks
[INFO] [compiler:testCompile {execution: default-testCompile}]
[INFO] Compiling 23 source files to /home/geronimo/geronimo/trunk/plugins/connector-1_6/geronimo-connector-builder-1_6/target/test-classes
[INFO] ------------------------------------------------------------------------
[ERROR] BUILD FAILURE
[INFO] ------------------------------------------------------------------------
[INFO] Compilation failure

/home/geronimo/geronimo/trunk/plugins/connector-1_6/geronimo-connector-builder-1_6/src/test/java/org/apache/geronimo/connector/deployment/ConnectorModuleBuilderTest.java:[132,45]
cannot find symbol
symbol  : constructor EARConfigBuilder(org.apache.geronimo.kernel.repository.Environment,org.apache.geronimo.gbean.AbstractNameQuery,org.apache.geronimo.gbean.AbstractNameQuery,<nulltype>,<nulltype>,org.apache.geronimo.gbean.AbstractNameQuery,java.util.Set<org.apache.geronimo.kernel.mock.MockRepository>,<nulltype>,<nulltype>,org.apache.geronimo.connector.deployment.ConnectorModuleBuilder,org.apache.geronimo.j2ee.deployment.ActivationSpecInfoLocator,<nulltype>,org.apache.geronimo.deployment.service.GBeanBuilder,<nulltype>,org.apache.geronimo.j2ee.deployment.NamingBuilderCollection,org.apache.geronimo.kernel.Naming,<nulltype>,org.osgi.framework.BundleContext)
location: class org.apache.geronimo.j2ee.deployment.EARConfigBuilder

/home/geronimo/geronimo/trunk/plugins/connector-1_6/geronimo-connector-builder-1_6/src/test/java/org/apache/geronimo/connector/deployment/MockRARDeployable.java:[67,22]
[deprecation] getModuleDTDVersion() in javax.enterprise.deploy.model.DeployableObject has
been deprecated


[INFO] ------------------------------------------------------------------------
[INFO] Trace
org.apache.maven.BuildFailureException: Compilation failure
	at org.apache.maven.lifecycle.DefaultLifecycleExecutor.executeGoals(DefaultLifecycleExecutor.java:715)
	at org.apache.maven.lifecycle.DefaultLifecycleExecutor.executeGoalWithLifecycle(DefaultLifecycleExecutor.java:556)
	at org.apache.maven.lifecycle.DefaultLifecycleExecutor.executeGoal(DefaultLifecycleExecutor.java:535)
	at org.apache.maven.lifecycle.DefaultLifecycleExecutor.executeGoalAndHandleFailures(DefaultLifecycleExecutor.java:387)
	at org.apache.maven.lifecycle.DefaultLifecycleExecutor.executeTaskSegments(DefaultLifecycleExecutor.java:348)
	at org.apache.maven.lifecycle.DefaultLifecycleExecutor.execute(DefaultLifecycleExecutor.java:180)
	at org.apache.maven.DefaultMaven.doExecute(DefaultMaven.java:328)
	at org.apache.maven.DefaultMaven.execute(DefaultMaven.java:138)
	at org.apache.maven.cli.MavenCli.main(MavenCli.java:362)
	at org.apache.maven.cli.compat.CompatibleMain.main(CompatibleMain.java:60)
	at sun.reflect.NativeMethodAccessorImpl.invoke0(Native Method)
	at sun.reflect.NativeMethodAccessorImpl.invoke(NativeMethodAccessorImpl.java:39)
	at sun.reflect.DelegatingMethodAccessorImpl.invoke(DelegatingMethodAccessorImpl.java:25)
	at java.lang.reflect.Method.invoke(Method.java:597)
	at org.codehaus.classworlds.Launcher.launchEnhanced(Launcher.java:315)
	at org.codehaus.classworlds.Launcher.launch(Launcher.java:255)
	at org.codehaus.classworlds.Launcher.mainWithExitCode(Launcher.java:430)
	at org.codehaus.classworlds.Launcher.main(Launcher.java:375)
Caused by: org.apache.maven.plugin.CompilationFailureException: Compilation failure
	at org.apache.maven.plugin.AbstractCompilerMojo.execute(AbstractCompilerMojo.java:516)
	at org.apache.maven.plugin.TestCompilerMojo.execute(TestCompilerMojo.java:102)
	at org.apache.maven.plugin.DefaultPluginManager.executeMojo(DefaultPluginManager.java:490)
	at org.apache.maven.lifecycle.DefaultLifecycleExecutor.executeGoals(DefaultLifecycleExecutor.java:694)
	... 17 more
[INFO] ------------------------------------------------------------------------
[INFO] Total time: 23 minutes 59 seconds
[INFO] Finished at: Mon Jan 17 03:26:00 EST 2011
[INFO] Final Memory: 467M/1002M
[INFO] ------------------------------------------------------------------------

Mime
View raw message