geronimo-dev mailing list archives

Site index · List index
Message view « Date » · « Thread »
Top « Date » · « Thread »
From ga...@apache.org
Subject [BUILD] trunk: Failed for Revision: 1059651
Date Sun, 16 Jan 2011 23:52:56 GMT
Geronimo Revision: 1059651 built with tests included
 
See the full build-1500.log file at http://people.apache.org/builds/geronimo/server/binaries/trunk/20110116/build-1500.log
 
Download the binaries from http://people.apache.org/builds/geronimo/server/binaries/trunk/20110116
[INFO] BUILD SUCCESSFUL
[INFO] ------------------------------------------------------------------------
[INFO] Total time: 63 minutes 9 seconds
[INFO] Finished at: Sun Jan 16 16:10:07 EST 2011
[INFO] Final Memory: 503M/1005M
[INFO] ------------------------------------------------------------------------
 
TESTSUITE RESULTS (Failures only)
=================================
 
Assembly: tomcat
=================================
See full test results and logs at http://people.apache.org/builds/geronimo/server/binaries/trunk/20110116/logs-1500-tomcat/
 
Running TestSuite
Tests run: 22, Failures: 1, Errors: 0, Skipped: 0, Time elapsed: 3.694 sec <<< FAILURE!
Running TestSuite
Tests run: 3, Failures: 3, Errors: 0, Skipped: 0, Time elapsed: 12.632 sec <<< FAILURE!
--
Running TestSuite
Tests run: 2, Failures: 1, Errors: 0, Skipped: 0, Time elapsed: 15.239 sec <<< FAILURE!
--
Running TestSuite
Tests run: 1, Failures: 1, Errors: 0, Skipped: 0, Time elapsed: 60.506 sec <<< FAILURE!
Running TestSuite
Tests run: 1, Failures: 1, Errors: 0, Skipped: 0, Time elapsed: 60.577 sec <<< FAILURE!
Running TestSuite
Tests run: 9, Failures: 9, Errors: 0, Skipped: 0, Time elapsed: 14.541 sec <<< FAILURE!
--
Running TestSuite
Tests run: 1, Failures: 1, Errors: 0, Skipped: 0, Time elapsed: 13.467 sec <<< FAILURE!
Running TestSuite
Tests run: 3, Failures: 2, Errors: 0, Skipped: 0, Time elapsed: 8.622 sec <<< FAILURE!
--
Running TestSuite
Tests run: 14, Failures: 14, Errors: 0, Skipped: 0, Time elapsed: 9.586 sec <<< FAILURE!
 
Assembly: jetty
=================================
See full test results and logs at http://people.apache.org/builds/geronimo/server/binaries/trunk/20110116/logs-1500-jetty/
 
Running TestSuite
Tests run: 1, Failures: 1, Errors: 0, Skipped: 0, Time elapsed: 12.141 sec <<< FAILURE!
--
Running TestSuite
Tests run: 22, Failures: 7, Errors: 0, Skipped: 0, Time elapsed: 3.433 sec <<< FAILURE!
Running TestSuite
Tests run: 3, Failures: 3, Errors: 0, Skipped: 0, Time elapsed: 12.396 sec <<< FAILURE!
Running TestSuite
Tests run: 2, Failures: 2, Errors: 0, Skipped: 0, Time elapsed: 1.597 sec <<< FAILURE!
Running TestSuite
Tests run: 4, Failures: 4, Errors: 0, Skipped: 0, Time elapsed: 2.325 sec <<< FAILURE!
--
Running TestSuite
Tests run: 1, Failures: 1, Errors: 0, Skipped: 0, Time elapsed: 1.874 sec <<< FAILURE!
Running TestSuite
Tests run: 2, Failures: 2, Errors: 0, Skipped: 0, Time elapsed: 8.651 sec <<< FAILURE!
--
Running TestSuite
Tests run: 2, Failures: 1, Errors: 0, Skipped: 0, Time elapsed: 1.701 sec <<< FAILURE!
--
Running TestSuite
Tests run: 2, Failures: 1, Errors: 0, Skipped: 0, Time elapsed: 1.86 sec <<< FAILURE!
--
Running TestSuite
Tests run: 1, Failures: 1, Errors: 0, Skipped: 0, Time elapsed: 60.601 sec <<< FAILURE!
Running TestSuite
Tests run: 1, Failures: 1, Errors: 0, Skipped: 0, Time elapsed: 60.501 sec <<< FAILURE!
Running TestSuite
Tests run: 9, Failures: 9, Errors: 0, Skipped: 0, Time elapsed: 16.764 sec <<< FAILURE!
Running TestSuite
Tests run: 1, Failures: 1, Errors: 0, Skipped: 0, Time elapsed: 1.534 sec <<< FAILURE!
--
Running TestSuite
Tests run: 1, Failures: 1, Errors: 0, Skipped: 0, Time elapsed: 7.511 sec <<< FAILURE!
Running TestSuite
Tests run: 3, Failures: 2, Errors: 0, Skipped: 0, Time elapsed: 8.556 sec <<< FAILURE!
--
Running TestSuite
Tests run: 14, Failures: 14, Errors: 0, Skipped: 0, Time elapsed: 10.562 sec <<<
FAILURE!
 
Samples: trunk
=================================
Log: http://people.apache.org/builds/geronimo/server/binaries/trunk/20110116/samples-1500.log
 
Build status: FAILED
 

Mime
View raw message