geronimo-dev mailing list archives

Site index · List index
Message view « Date » · « Thread »
Top « Date » · « Thread »
From ga...@apache.org
Subject [BUILD] trunk: Failed for Revision: 1059151
Date Fri, 14 Jan 2011 23:39:51 GMT
Geronimo Revision: 1059151 built with tests included
 
See the full build-1500.log file at http://people.apache.org/builds/geronimo/server/binaries/trunk/20110114/build-1500.log
 
Download the binaries from http://people.apache.org/builds/geronimo/server/binaries/trunk/20110114
[INFO] BUILD SUCCESSFUL
[INFO] ------------------------------------------------------------------------
[INFO] Total time: 49 minutes 24 seconds
[INFO] Finished at: Fri Jan 14 15:56:22 EST 2011
[INFO] Final Memory: 522M/998M
[INFO] ------------------------------------------------------------------------
 
TESTSUITE RESULTS (Failures only)
=================================
 
Assembly: tomcat
=================================
See full test results and logs at http://people.apache.org/builds/geronimo/server/binaries/trunk/20110114/logs-1500-tomcat/
 
Running TestSuite
Tests run: 22, Failures: 1, Errors: 0, Skipped: 0, Time elapsed: 3.377 sec <<< FAILURE!
Running TestSuite
Tests run: 3, Failures: 3, Errors: 0, Skipped: 0, Time elapsed: 12.669 sec <<< FAILURE!
--
Running TestSuite
Tests run: 2, Failures: 1, Errors: 0, Skipped: 0, Time elapsed: 11.82 sec <<< FAILURE!
--
Running TestSuite
Tests run: 1, Failures: 1, Errors: 0, Skipped: 0, Time elapsed: 60.611 sec <<< FAILURE!
Running TestSuite
Tests run: 1, Failures: 1, Errors: 0, Skipped: 0, Time elapsed: 60.497 sec <<< FAILURE!
Running TestSuite
Tests run: 9, Failures: 9, Errors: 0, Skipped: 0, Time elapsed: 13.667 sec <<< FAILURE!
--
Running TestSuite
Tests run: 1, Failures: 1, Errors: 0, Skipped: 0, Time elapsed: 13.566 sec <<< FAILURE!
Running TestSuite
Tests run: 3, Failures: 2, Errors: 0, Skipped: 0, Time elapsed: 8.685 sec <<< FAILURE!
--
Running TestSuite
Tests run: 14, Failures: 14, Errors: 0, Skipped: 0, Time elapsed: 9.648 sec <<< FAILURE!
 
Assembly: jetty
=================================
See full test results and logs at http://people.apache.org/builds/geronimo/server/binaries/trunk/20110114/logs-1500-jetty/
 
Running TestSuite
Tests run: 1, Failures: 1, Errors: 0, Skipped: 0, Time elapsed: 12.677 sec <<< FAILURE!
--
Running TestSuite
Tests run: 22, Failures: 7, Errors: 0, Skipped: 0, Time elapsed: 3.405 sec <<< FAILURE!
Running TestSuite
Tests run: 3, Failures: 3, Errors: 0, Skipped: 0, Time elapsed: 12.846 sec <<< FAILURE!
Running TestSuite
Tests run: 2, Failures: 2, Errors: 0, Skipped: 0, Time elapsed: 1.771 sec <<< FAILURE!
Running TestSuite
Tests run: 4, Failures: 4, Errors: 0, Skipped: 0, Time elapsed: 2.548 sec <<< FAILURE!
--
Running TestSuite
Tests run: 1, Failures: 1, Errors: 0, Skipped: 0, Time elapsed: 1.838 sec <<< FAILURE!
Running TestSuite
Tests run: 2, Failures: 2, Errors: 0, Skipped: 0, Time elapsed: 8.704 sec <<< FAILURE!
--
Running TestSuite
Tests run: 2, Failures: 1, Errors: 0, Skipped: 0, Time elapsed: 1.772 sec <<< FAILURE!
--
Running TestSuite
Tests run: 2, Failures: 1, Errors: 0, Skipped: 0, Time elapsed: 1.976 sec <<< FAILURE!
--
Running TestSuite
Tests run: 1, Failures: 1, Errors: 0, Skipped: 0, Time elapsed: 60.545 sec <<< FAILURE!
Running TestSuite
Tests run: 1, Failures: 1, Errors: 0, Skipped: 0, Time elapsed: 60.558 sec <<< FAILURE!
Running TestSuite
Tests run: 9, Failures: 9, Errors: 0, Skipped: 0, Time elapsed: 14.833 sec <<< FAILURE!
Running TestSuite
Tests run: 1, Failures: 1, Errors: 0, Skipped: 0, Time elapsed: 1.518 sec <<< FAILURE!
--
Running TestSuite
Tests run: 1, Failures: 1, Errors: 0, Skipped: 0, Time elapsed: 7.677 sec <<< FAILURE!
Running TestSuite
Tests run: 3, Failures: 2, Errors: 0, Skipped: 0, Time elapsed: 8.426 sec <<< FAILURE!
--
Running TestSuite
Tests run: 14, Failures: 14, Errors: 0, Skipped: 0, Time elapsed: 10.406 sec <<<
FAILURE!
 
Samples: trunk
=================================
Log: http://people.apache.org/builds/geronimo/server/binaries/trunk/20110114/samples-1500.log
 
Build status: FAILED
 

Mime
View raw message