geronimo-dev mailing list archives

Site index · List index
Message view « Date » · « Thread »
Top « Date » · « Thread »
From ga...@apache.org
Subject [BUILD] trunk: Failed for Revision: 1059014
Date Fri, 14 Jan 2011 17:46:58 GMT
Geronimo Revision: 1059014 built with tests included
 
See the full build-0900.log file at http://people.apache.org/builds/geronimo/server/binaries/trunk/20110114/build-0900.log
 
Download the binaries from http://people.apache.org/builds/geronimo/server/binaries/trunk/20110114
[INFO] BUILD SUCCESSFUL
[INFO] ------------------------------------------------------------------------
[INFO] Total time: 57 minutes 35 seconds
[INFO] Finished at: Fri Jan 14 10:04:25 EST 2011
[INFO] Final Memory: 565M/1006M
[INFO] ------------------------------------------------------------------------
 
TESTSUITE RESULTS (Failures only)
=================================
 
Assembly: tomcat
=================================
See full test results and logs at http://people.apache.org/builds/geronimo/server/binaries/trunk/20110114/logs-0900-tomcat/
 
Running TestSuite
Tests run: 22, Failures: 1, Errors: 0, Skipped: 0, Time elapsed: 3.342 sec <<< FAILURE!
Running TestSuite
Tests run: 3, Failures: 3, Errors: 0, Skipped: 0, Time elapsed: 13.205 sec <<< FAILURE!
--
Running TestSuite
Tests run: 2, Failures: 1, Errors: 0, Skipped: 0, Time elapsed: 12.173 sec <<< FAILURE!
--
Running TestSuite
Tests run: 1, Failures: 1, Errors: 0, Skipped: 0, Time elapsed: 60.54 sec <<< FAILURE!
Running TestSuite
Tests run: 1, Failures: 1, Errors: 0, Skipped: 0, Time elapsed: 60.485 sec <<< FAILURE!
Running TestSuite
Tests run: 9, Failures: 9, Errors: 0, Skipped: 0, Time elapsed: 14.268 sec <<< FAILURE!
--
Running TestSuite
Tests run: 1, Failures: 1, Errors: 0, Skipped: 0, Time elapsed: 13.456 sec <<< FAILURE!
Running TestSuite
Tests run: 3, Failures: 2, Errors: 0, Skipped: 0, Time elapsed: 8.626 sec <<< FAILURE!
--
Running TestSuite
Tests run: 14, Failures: 14, Errors: 0, Skipped: 0, Time elapsed: 9.574 sec <<< FAILURE!
 
Assembly: jetty
=================================
See full test results and logs at http://people.apache.org/builds/geronimo/server/binaries/trunk/20110114/logs-0900-jetty/
 
Running TestSuite
Tests run: 1, Failures: 1, Errors: 0, Skipped: 0, Time elapsed: 11.963 sec <<< FAILURE!
--
Running TestSuite
Tests run: 22, Failures: 7, Errors: 0, Skipped: 0, Time elapsed: 3.447 sec <<< FAILURE!
Running TestSuite
Tests run: 3, Failures: 3, Errors: 0, Skipped: 0, Time elapsed: 12.674 sec <<< FAILURE!
Running TestSuite
Tests run: 2, Failures: 2, Errors: 0, Skipped: 0, Time elapsed: 1.527 sec <<< FAILURE!
Running TestSuite
Tests run: 4, Failures: 4, Errors: 0, Skipped: 0, Time elapsed: 2.456 sec <<< FAILURE!
--
Running TestSuite
Tests run: 1, Failures: 1, Errors: 0, Skipped: 0, Time elapsed: 1.898 sec <<< FAILURE!
Running TestSuite
Tests run: 2, Failures: 2, Errors: 0, Skipped: 0, Time elapsed: 8.741 sec <<< FAILURE!
--
Running TestSuite
Tests run: 2, Failures: 1, Errors: 0, Skipped: 0, Time elapsed: 1.721 sec <<< FAILURE!
--
Running TestSuite
Tests run: 2, Failures: 1, Errors: 0, Skipped: 0, Time elapsed: 1.799 sec <<< FAILURE!
--
Running TestSuite
Tests run: 1, Failures: 1, Errors: 0, Skipped: 0, Time elapsed: 60.508 sec <<< FAILURE!
Running TestSuite
Tests run: 1, Failures: 1, Errors: 0, Skipped: 0, Time elapsed: 60.492 sec <<< FAILURE!
Running TestSuite
Tests run: 9, Failures: 9, Errors: 0, Skipped: 0, Time elapsed: 14.597 sec <<< FAILURE!
Running TestSuite
Tests run: 1, Failures: 1, Errors: 0, Skipped: 0, Time elapsed: 1.556 sec <<< FAILURE!
--
Running TestSuite
Tests run: 1, Failures: 1, Errors: 0, Skipped: 0, Time elapsed: 7.522 sec <<< FAILURE!
Running TestSuite
Tests run: 3, Failures: 2, Errors: 0, Skipped: 0, Time elapsed: 9.044 sec <<< FAILURE!
--
Running TestSuite
Tests run: 14, Failures: 14, Errors: 0, Skipped: 0, Time elapsed: 10.801 sec <<<
FAILURE!
 
Samples: trunk
=================================
Log: http://people.apache.org/builds/geronimo/server/binaries/trunk/20110114/samples-0900.log
 
Build status: FAILED
 

Mime
View raw message