geronimo-dev mailing list archives

Site index · List index
Message view « Date » · « Thread »
Top « Date » · « Thread »
From ga...@apache.org
Subject [BUILD] trunk: Failed for Revision: 1058884
Date Fri, 14 Jan 2011 11:44:26 GMT
Geronimo Revision: 1058884 built with tests included
 
See the full build-0300.log file at http://people.apache.org/builds/geronimo/server/binaries/trunk/20110114/build-0300.log
 
Download the binaries from http://people.apache.org/builds/geronimo/server/binaries/trunk/20110114
[INFO] BUILD SUCCESSFUL
[INFO] ------------------------------------------------------------------------
[INFO] Total time: 57 minutes 14 seconds
[INFO] Finished at: Fri Jan 14 04:01:27 EST 2011
[INFO] Final Memory: 486M/1006M
[INFO] ------------------------------------------------------------------------
 
TESTSUITE RESULTS (Failures only)
=================================
 
Assembly: tomcat
=================================
See full test results and logs at http://people.apache.org/builds/geronimo/server/binaries/trunk/20110114/logs-0300-tomcat/
 
Running TestSuite
Tests run: 22, Failures: 1, Errors: 0, Skipped: 0, Time elapsed: 3.419 sec <<< FAILURE!
Running TestSuite
Tests run: 3, Failures: 3, Errors: 0, Skipped: 0, Time elapsed: 12.741 sec <<< FAILURE!
--
Running TestSuite
Tests run: 2, Failures: 1, Errors: 0, Skipped: 0, Time elapsed: 12.251 sec <<< FAILURE!
--
Running TestSuite
Tests run: 1, Failures: 1, Errors: 0, Skipped: 0, Time elapsed: 60.547 sec <<< FAILURE!
Running TestSuite
Tests run: 1, Failures: 1, Errors: 0, Skipped: 0, Time elapsed: 60.497 sec <<< FAILURE!
Running TestSuite
Tests run: 9, Failures: 9, Errors: 0, Skipped: 0, Time elapsed: 14.128 sec <<< FAILURE!
--
Running TestSuite
Tests run: 1, Failures: 1, Errors: 0, Skipped: 0, Time elapsed: 13.563 sec <<< FAILURE!
Running TestSuite
Tests run: 3, Failures: 2, Errors: 0, Skipped: 0, Time elapsed: 8.485 sec <<< FAILURE!
--
Running TestSuite
Tests run: 14, Failures: 14, Errors: 0, Skipped: 0, Time elapsed: 9.657 sec <<< FAILURE!
 
Assembly: jetty
=================================
See full test results and logs at http://people.apache.org/builds/geronimo/server/binaries/trunk/20110114/logs-0300-jetty/
 
Running TestSuite
Tests run: 1, Failures: 1, Errors: 0, Skipped: 0, Time elapsed: 12.526 sec <<< FAILURE!
--
Running TestSuite
Tests run: 22, Failures: 7, Errors: 0, Skipped: 0, Time elapsed: 3.403 sec <<< FAILURE!
Running TestSuite
Tests run: 3, Failures: 3, Errors: 0, Skipped: 0, Time elapsed: 12.916 sec <<< FAILURE!
Running TestSuite
Tests run: 2, Failures: 2, Errors: 0, Skipped: 0, Time elapsed: 1.552 sec <<< FAILURE!
Running TestSuite
Tests run: 4, Failures: 4, Errors: 0, Skipped: 0, Time elapsed: 2.372 sec <<< FAILURE!
--
Running TestSuite
Tests run: 1, Failures: 1, Errors: 0, Skipped: 0, Time elapsed: 2.041 sec <<< FAILURE!
Running TestSuite
Tests run: 2, Failures: 2, Errors: 0, Skipped: 0, Time elapsed: 10.502 sec <<< FAILURE!
--
Running TestSuite
Tests run: 2, Failures: 1, Errors: 0, Skipped: 0, Time elapsed: 1.741 sec <<< FAILURE!
--
Running TestSuite
Tests run: 2, Failures: 1, Errors: 0, Skipped: 0, Time elapsed: 1.822 sec <<< FAILURE!
--
Running TestSuite
Tests run: 1, Failures: 1, Errors: 0, Skipped: 0, Time elapsed: 60.54 sec <<< FAILURE!
Running TestSuite
Tests run: 1, Failures: 1, Errors: 0, Skipped: 0, Time elapsed: 60.576 sec <<< FAILURE!
Running TestSuite
Tests run: 9, Failures: 9, Errors: 0, Skipped: 0, Time elapsed: 14.28 sec <<< FAILURE!
Running TestSuite
Tests run: 1, Failures: 1, Errors: 0, Skipped: 0, Time elapsed: 1.534 sec <<< FAILURE!
--
Running TestSuite
Tests run: 1, Failures: 1, Errors: 0, Skipped: 0, Time elapsed: 7.78 sec <<< FAILURE!
Running TestSuite
Tests run: 3, Failures: 2, Errors: 0, Skipped: 0, Time elapsed: 8.35 sec <<< FAILURE!
--
Running TestSuite
Tests run: 14, Failures: 14, Errors: 0, Skipped: 0, Time elapsed: 10.474 sec <<<
FAILURE!
 
Samples: trunk
=================================
Log: http://people.apache.org/builds/geronimo/server/binaries/trunk/20110114/samples-0300.log
 
Build status: FAILED
 

Mime
View raw message