geronimo-dev mailing list archives

Site index · List index
Message view « Date » · « Thread »
Top « Date » · « Thread »
From ga...@apache.org
Subject [BUILD] trunk: Failed for Revision: 1056709
Date Sat, 08 Jan 2011 14:42:01 GMT
Geronimo Revision: 1056709 built with tests included
 
See the full build-0900.log file at http://people.apache.org/builds/geronimo/server/binaries/trunk/20110108/build-0900.log
 
 
See the unit test reports at http://people.apache.org/builds/geronimo/server/binaries/trunk/20110108/unit-test-reports
 
[INFO] Unable to find resource 'org.apache.servicemix.bundles:org.apache.servicemix.bundles.dom4j:jar:1.6.1_2'
in repository local (file:///home/geronimo/.m2/jtidy.repository)
Downloading: https://repository.apache.org/content/repositories/orgapachegeronimo-068//org/apache/servicemix/bundles/org.apache.servicemix.bundles.dom4j/1.6.1_2/org.apache.servicemix.bundles.dom4j-1.6.1_2.jar
Downloading: http://repository.apache.org/snapshots/org/apache/openwebbeans/openwebbeans-web/1.1.0-SNAPSHOT/openwebbeans-web-1.1.0-20110107.184055-7.jar
38K downloaded  (openwebbeans-web-1.1.0-20110107.184055-7.jar)
[INFO] Unable to find resource 'org.apache.geronimo.bundles:commons-discovery:jar:0.4_1' in
repository geornimo bundle scout-1.2.2_1 stage (https://repository.apache.org/content/repositories/orgapachegeronimo-068/)
Downloading: http://oss.sonatype.org/content/groups/jetty-with-staging/org/apache/geronimo/bundles/commons-discovery/0.4_1/commons-discovery-0.4_1.jar
[INFO] Unable to find resource 'org.apache.servicemix.bundles:org.apache.servicemix.bundles.dom4j:jar:1.6.1_2'
in repository geornimo bundle scout-1.2.2_1 stage (https://repository.apache.org/content/repositories/orgapachegeronimo-068/)
Downloading: http://oss.sonatype.org/content/groups/jetty-with-staging/org/apache/servicemix/bundles/org.apache.servicemix.bundles.dom4j/1.6.1_2/org.apache.servicemix.bundles.dom4j-1.6.1_2.jar
[INFO] Unable to find resource 'org.apache.myfaces.core:myfaces-bundle:jar:2.0.3' in repository
geornimo bundle scout-1.2.2_1 stage (https://repository.apache.org/content/repositories/orgapachegeronimo-068/)
Downloading: http://oss.sonatype.org/content/groups/jetty-with-staging/org/apache/myfaces/core/myfaces-bundle/2.0.3/myfaces-bundle-2.0.3.jar
[INFO] Unable to find resource 'org.apache.geronimo.bundles:commons-discovery:jar:0.4_1' in
repository jetty.oss.sonatype.org (http://oss.sonatype.org/content/groups/jetty-with-staging)
Downloading: http://svn.apache.org/repos/asf/servicemix/m2-repo//org/apache/geronimo/bundles/commons-discovery/0.4_1/commons-discovery-0.4_1.jar
[INFO] Unable to find resource 'org.apache.servicemix.bundles:org.apache.servicemix.bundles.dom4j:jar:1.6.1_2'
in repository jetty.oss.sonatype.org (http://oss.sonatype.org/content/groups/jetty-with-staging)
[INFO] Unable to find resource 'org.apache.myfaces.core:myfaces-bundle:jar:2.0.3' in repository
jetty.oss.sonatype.org (http://oss.sonatype.org/content/groups/jetty-with-staging)
Downloading: http://svn.apache.org/repos/asf/servicemix/m2-repo//org/apache/servicemix/bundles/org.apache.servicemix.bundles.dom4j/1.6.1_2/org.apache.servicemix.bundles.dom4j-1.6.1_2.jar
Downloading: http://svn.apache.org/repos/asf/servicemix/m2-repo//org/apache/myfaces/core/myfaces-bundle/2.0.3/myfaces-bundle-2.0.3.jar
Downloading: http://repository.apache.org/snapshots/org/apache/openwebbeans/openwebbeans-jsf/1.1.0-SNAPSHOT/openwebbeans-jsf-1.1.0-20110107.185927-7.jar
[INFO] Unable to find resource 'org.apache.geronimo.bundles:commons-discovery:jar:0.4_1' in
repository smx.svn (http://svn.apache.org/repos/asf/servicemix/m2-repo/)
Downloading: http://download.java.net/maven/1//org.apache.geronimo.bundles/jars/commons-discovery-0.4_1.jar
[INFO] Unable to find resource 'org.apache.myfaces.core:myfaces-bundle:jar:2.0.3' in repository
smx.svn (http://svn.apache.org/repos/asf/servicemix/m2-repo/)
[INFO] Unable to find resource 'org.apache.servicemix.bundles:org.apache.servicemix.bundles.dom4j:jar:1.6.1_2'
in repository smx.svn (http://svn.apache.org/repos/asf/servicemix/m2-repo/)
Downloading: http://download.java.net/maven/1//org.apache.servicemix.bundles/jars/org.apache.servicemix.bundles.dom4j-1.6.1_2.jar
Downloading: http://download.java.net/maven/1//org.apache.myfaces.core/jars/myfaces-bundle-2.0.3.jar
[INFO] Unable to find resource 'org.apache.geronimo.bundles:commons-discovery:jar:0.4_1' in
repository java.net (http://download.java.net/maven/1/)
Downloading: http://nexus.openqa.org/content/repositories/releases/org/apache/geronimo/bundles/commons-discovery/0.4_1/commons-discovery-0.4_1.jar
29K downloaded  (openwebbeans-jsf-1.1.0-20110107.185927-7.jar)
[INFO] Unable to find resource 'org.apache.geronimo.bundles:commons-discovery:jar:0.4_1' in
repository openqa-releases (http://nexus.openqa.org/content/repositories/releases)
Downloading: http://maven.rtp.raleigh.ibm.com/nexus-proxy//org/apache/geronimo/bundles/commons-discovery/0.4_1/commons-discovery-0.4_1.jar
[INFO] Unable to find resource 'org.apache.servicemix.bundles:org.apache.servicemix.bundles.dom4j:jar:1.6.1_2'
in repository java.net (http://download.java.net/maven/1/)
78K downloaded  (commons-discovery-0.4_1.jar)
Downloading: http://nexus.openqa.org/content/repositories/releases/org/apache/servicemix/bundles/org.apache.servicemix.bundles.dom4j/1.6.1_2/org.apache.servicemix.bundles.dom4j-1.6.1_2.jar
[INFO] Unable to find resource 'org.apache.myfaces.core:myfaces-bundle:jar:2.0.3' in repository
java.net (http://download.java.net/maven/1/)
Downloading: http://nexus.openqa.org/content/repositories/releases/org/apache/myfaces/core/myfaces-bundle/2.0.3/myfaces-bundle-2.0.3.jar
Downloading: http://repository.apache.org/snapshots/org/apache/openwebbeans/openwebbeans-resource/1.1.0-SNAPSHOT/openwebbeans-resource-1.1.0-20110107.190333-7.jar
13K downloaded  (openwebbeans-resource-1.1.0-20110107.190333-7.jar)
[INFO] Unable to find resource 'org.apache.servicemix.bundles:org.apache.servicemix.bundles.dom4j:jar:1.6.1_2'
in repository openqa-releases (http://nexus.openqa.org/content/repositories/releases)
Downloading: http://maven.rtp.raleigh.ibm.com/nexus-proxy//org/apache/servicemix/bundles/org.apache.servicemix.bundles.dom4j/1.6.1_2/org.apache.servicemix.bundles.dom4j-1.6.1_2.jar
[INFO] Unable to find resource 'org.apache.myfaces.core:myfaces-bundle:jar:2.0.3' in repository
openqa-releases (http://nexus.openqa.org/content/repositories/releases)
Downloading: http://maven.rtp.raleigh.ibm.com/nexus-proxy//org/apache/myfaces/core/myfaces-bundle/2.0.3/myfaces-bundle-2.0.3.jar
313K downloaded  (org.apache.servicemix.bundles.dom4j-1.6.1_2.jar)
2491K downloaded  (myfaces-bundle-2.0.3.jar)
[INFO] [enforcer:enforce {execution: default}]
[INFO] [remote-resources:process {execution: default}]
[INFO] [resources:resources {execution: default-resources}]
[INFO] Using 'UTF-8' encoding to copy filtered resources.
[INFO] Copying 1 resource
[INFO] skip non existing resourceDirectory /home/geronimo/geronimo/trunk/plugins/openwebbeans/geronimo-openwebbeans/src/main/filtered-resources
[INFO] Copying 3 resources
[INFO] [compiler:compile {execution: default-compile}]
[INFO] Compiling 9 source files to /home/geronimo/geronimo/trunk/plugins/openwebbeans/geronimo-openwebbeans/target/classes
[INFO] ------------------------------------------------------------------------
[ERROR] BUILD FAILURE
[INFO] ------------------------------------------------------------------------
[INFO] Compilation failure

/home/geronimo/geronimo/trunk/plugins/openwebbeans/geronimo-openwebbeans/src/main/java/org/apache/geronimo/openwebbeans/GeronimoSingletonService.java:[31,65]
type org.apache.webbeans.spi.SingletonService does not take parameters

/home/geronimo/geronimo/trunk/plugins/openwebbeans/geronimo-openwebbeans/src/main/java/org/apache/geronimo/openwebbeans/GeronimoSingletonService.java:[38,22]
setSingletonService(org.apache.webbeans.spi.SingletonService) in org.apache.webbeans.config.WebBeansFinder
cannot be applied to (org.apache.geronimo.openwebbeans.GeronimoSingletonService)

/home/geronimo/geronimo/trunk/plugins/openwebbeans/geronimo-openwebbeans/src/main/java/org/apache/geronimo/openwebbeans/GeronimoSingletonService.java:[54,4]
method does not override or implement a method from a supertype

/home/geronimo/geronimo/trunk/plugins/openwebbeans/geronimo-openwebbeans/src/main/java/org/apache/geronimo/openwebbeans/GeronimoSingletonService.java:[67,4]
method does not override or implement a method from a supertype

/home/geronimo/geronimo/trunk/plugins/openwebbeans/geronimo-openwebbeans/src/main/java/org/apache/geronimo/openwebbeans/OpenWebBeansWebInitializer.java:[48,62]
[deprecation] getInstance() in org.apache.webbeans.config.WebBeansContext has been deprecated

/home/geronimo/geronimo/trunk/plugins/openwebbeans/geronimo-openwebbeans/src/main/java/org/apache/geronimo/openwebbeans/WebBeansConfigurationListener.java:[78,46]
[deprecation] getInstance() in org.apache.webbeans.config.WebBeansContext has been deprecated


[INFO] ------------------------------------------------------------------------
[INFO] Trace
org.apache.maven.BuildFailureException: Compilation failure
	at org.apache.maven.lifecycle.DefaultLifecycleExecutor.executeGoals(DefaultLifecycleExecutor.java:715)
	at org.apache.maven.lifecycle.DefaultLifecycleExecutor.executeGoalWithLifecycle(DefaultLifecycleExecutor.java:556)
	at org.apache.maven.lifecycle.DefaultLifecycleExecutor.executeGoal(DefaultLifecycleExecutor.java:535)
	at org.apache.maven.lifecycle.DefaultLifecycleExecutor.executeGoalAndHandleFailures(DefaultLifecycleExecutor.java:387)
	at org.apache.maven.lifecycle.DefaultLifecycleExecutor.executeTaskSegments(DefaultLifecycleExecutor.java:348)
	at org.apache.maven.lifecycle.DefaultLifecycleExecutor.execute(DefaultLifecycleExecutor.java:180)
	at org.apache.maven.DefaultMaven.doExecute(DefaultMaven.java:328)
	at org.apache.maven.DefaultMaven.execute(DefaultMaven.java:138)
	at org.apache.maven.cli.MavenCli.main(MavenCli.java:362)
	at org.apache.maven.cli.compat.CompatibleMain.main(CompatibleMain.java:60)
	at sun.reflect.NativeMethodAccessorImpl.invoke0(Native Method)
	at sun.reflect.NativeMethodAccessorImpl.invoke(NativeMethodAccessorImpl.java:39)
	at sun.reflect.DelegatingMethodAccessorImpl.invoke(DelegatingMethodAccessorImpl.java:25)
	at java.lang.reflect.Method.invoke(Method.java:597)
	at org.codehaus.classworlds.Launcher.launchEnhanced(Launcher.java:315)
	at org.codehaus.classworlds.Launcher.launch(Launcher.java:255)
	at org.codehaus.classworlds.Launcher.mainWithExitCode(Launcher.java:430)
	at org.codehaus.classworlds.Launcher.main(Launcher.java:375)
Caused by: org.apache.maven.plugin.CompilationFailureException: Compilation failure
	at org.apache.maven.plugin.AbstractCompilerMojo.execute(AbstractCompilerMojo.java:516)
	at org.apache.maven.plugin.CompilerMojo.execute(CompilerMojo.java:114)
	at org.apache.maven.plugin.DefaultPluginManager.executeMojo(DefaultPluginManager.java:490)
	at org.apache.maven.lifecycle.DefaultLifecycleExecutor.executeGoals(DefaultLifecycleExecutor.java:694)
	... 17 more
[INFO] ------------------------------------------------------------------------
[INFO] Total time: 23 minutes 50 seconds
[INFO] Finished at: Sat Jan 08 09:27:42 EST 2011
[INFO] Final Memory: 436M/966M
[INFO] ------------------------------------------------------------------------

Mime
View raw message