geronimo-dev mailing list archives

Site index · List index
Message view « Date » · « Thread »
Top « Date » · « Thread »
From ga...@apache.org
Subject [BUILD] branches/2.2: Failed for Revision: 1054454
Date Sun, 02 Jan 2011 21:57:49 GMT
Geronimo Revision: 1054454 built with tests included
 
See the full build-1400.log file at http://people.apache.org/builds/geronimo/server/binaries/2.2/20110102/build-1400.log
 
Download the binaries from http://people.apache.org/builds/geronimo/server/binaries/2.2/20110102
[INFO] BUILD SUCCESSFUL
[INFO] ------------------------------------------------------------------------
[INFO] Total time: 38 minutes 59 seconds
[INFO] Finished at: Sun Jan 02 14:42:08 EST 2011
[INFO] Final Memory: 305M/1004M
[INFO] ------------------------------------------------------------------------
 
TESTSUITE RESULTS (Failures only)
=================================
 
Assembly: tomcat
=================================
See full test results and logs at http://people.apache.org/builds/geronimo/server/binaries/2.2/20110102/logs-1400-tomcat/
 
[INFO] Running TestSuite
[INFO] Tests run: 40, Failures: 27, Errors: 0, Skipped: 0, Time elapsed: 209.615 sec <<<
FAILURE!
[INFO] Running TestSuite
[INFO] Tests run: 12, Failures: 6, Errors: 0, Skipped: 0, Time elapsed: 77.321 sec <<<
FAILURE!
--
[INFO] Running TestSuite
[INFO] Tests run: 36, Failures: 1, Errors: 0, Skipped: 0, Time elapsed: 69.229 sec <<<
FAILURE!
--
[INFO] Running TestSuite
[INFO] Tests run: 10, Failures: 1, Errors: 0, Skipped: 0, Time elapsed: 31.993 sec <<<
FAILURE!
 
Assembly: jetty
=================================
See full test results and logs at http://people.apache.org/builds/geronimo/server/binaries/2.2/20110102/logs-1400-jetty/
 
[INFO] Running TestSuite
[INFO] Tests run: 116, Failures: 3, Errors: 0, Skipped: 113, Time elapsed: 16.624 sec <<<
FAILURE!
[INFO] Running TestSuite
[INFO] Tests run: 12, Failures: 9, Errors: 0, Skipped: 0, Time elapsed: 73.865 sec <<<
FAILURE!
--
[INFO] Running TestSuite
[INFO] Tests run: 2, Failures: 2, Errors: 0, Skipped: 0, Time elapsed: 8.69 sec <<<
FAILURE!
 
Samples: branches/2.2
=================================
Log: http://people.apache.org/builds/geronimo/server/binaries/2.2/20110102/samples-1400.log
 
Build status: OK
 

Mime
View raw message