geronimo-dev mailing list archives

Site index · List index
Message view « Date » · « Thread »
Top « Date » · « Thread »
From andronat_asf <andronat_...@hotmail.com>
Subject Cant mvn install
Date Thu, 30 Dec 2010 21:36:59 GMT
Hello!

	I'm trying to do mvn install to geronimo-2.2.1, geronimo-3.0-M1 and geronimo-trunk versions
but I'm getting test failures. All versions are checked out from svn repo. 

-------------------------------------------------------
 T E S T S
-------------------------------------------------------
Running org.apache.geronimo.deployment.service.JavaBeanXmlAttributeEditorTest
Tests run: 2, Failures: 0, Errors: 0, Skipped: 0, Time elapsed: 0.898 sec
Running org.apache.geronimo.deployment.service.ServiceConfigBuilderTest
Tests run: 2, Failures: 0, Errors: 1, Skipped: 0, Time elapsed: 0.323 sec <<< FAILURE!
Running org.apache.geronimo.deployment.service.ClassLoadingRulesUtilTest
Tests run: 1, Failures: 0, Errors: 0, Skipped: 0, Time elapsed: 0.019 sec
Running org.apache.geronimo.deployment.service.EnvironmentBuilderTest
Tests run: 3, Failures: 0, Errors: 0, Skipped: 0, Time elapsed: 0.011 sec

Results :

Tests in error: 
  testNonService(org.apache.geronimo.deployment.service.ServiceConfigBuilderTest)

Tests run: 8, Failures: 0, Errors: 1, Skipped: 0

[INFO] ------------------------------------------------------------------------
[ERROR] BUILD FAILURE
[INFO] ------------------------------------------------------------------------
[INFO] There are test failures.

I commend out this test but more failures came up.


-------------------------------------------------------
 T E S T S
-------------------------------------------------------
Running org.apache.geronimo.deployment.tools.ClientDeployableTest
Tests run: 1, Failures: 0, Errors: 1, Skipped: 0, Time elapsed: 0.089 sec <<< FAILURE!
Running org.apache.geronimo.deployment.tools.WebDeployableTest
Tests run: 1, Failures: 0, Errors: 1, Skipped: 0, Time elapsed: 0.014 sec <<< FAILURE!
Running org.apache.geronimo.deployment.tools.DDBeanRootTest
Tests run: 1, Failures: 0, Errors: 0, Skipped: 0, Time elapsed: 0.308 sec

Results :

Tests in error: 
  testLoadClient(org.apache.geronimo.deployment.tools.ClientDeployableTest)
  testWebClasspath(org.apache.geronimo.deployment.tools.WebDeployableTest)

Tests run: 3, Failures: 0, Errors: 2, Skipped: 0


I tried to commend out those too but...


-------------------------------------------------------
 T E S T S
-------------------------------------------------------
Running org.apache.geronimo.deployment.tools.ClientDeployableTest
Tests run: 1, Failures: 1, Errors: 0, Skipped: 0, Time elapsed: 0.035 sec <<< FAILURE!
Running org.apache.geronimo.deployment.tools.WebDeployableTest
Tests run: 1, Failures: 1, Errors: 0, Skipped: 0, Time elapsed: 0.016 sec <<< FAILURE!
Running org.apache.geronimo.deployment.tools.DDBeanRootTest
Tests run: 1, Failures: 0, Errors: 0, Skipped: 0, Time elapsed: 0.305 sec

Results :

Failed tests: 
  warning(junit.framework.TestSuite$1)
  warning(junit.framework.TestSuite$1)

Tests run: 3, Failures: 2, Errors: 0, Skipped: 0


I am running in Mac OS 10.6 with:

Apache Maven 2.2.1 (r801777; 2009-08-06 22:16:01+0300)
Java version: 1.6.0_22
OS name: "mac os x" version: "10.6.5" arch: "x86_64"


Mime
View raw message