geronimo-dev mailing list archives

Site index · List index
Message view « Date » · « Thread »
Top « Date » · « Thread »
From Shawn Jiang <genspr...@gmail.com>
Subject Re: [BUILD] trunk: Failed for Revision: 1041721
Date Fri, 03 Dec 2010 08:45:04 GMT
The server build failed again.

On Fri, Dec 3, 2010 at 4:33 PM,  <gawor@apache.org> wrote:
> Geronimo Revision: 1041721 built with tests included
>
> See the full build-0300.log file at http://people.apache.org/builds/geronimo/server/binaries/trunk/20101203/build-0300.log
>
>
> See the unit test reports at http://people.apache.org/builds/geronimo/server/binaries/trunk/20101203/unit-test-reports
>
> [INFO] Using 'UTF-8' encoding to copy filtered resources.
> [INFO] Copying 1 resource
> [INFO] skip non existing resourceDirectory /home/geronimo/geronimo/trunk/plugins/openwebbeans/geronimo-openwebbeans/src/main/filtered-resources
> [INFO] Copying 3 resources
> [INFO] [compiler:compile {execution: default-compile}]
> [INFO] Compiling 8 source files to /home/geronimo/geronimo/trunk/plugins/openwebbeans/geronimo-openwebbeans/target/classes
> [INFO] ------------------------------------------------------------------------
> [ERROR] BUILD FAILURE
> [INFO] ------------------------------------------------------------------------
> [INFO] Compilation failure
>
> /home/geronimo/geronimo/trunk/plugins/openwebbeans/geronimo-openwebbeans/src/main/java/org/apache/geronimo/openwebbeans/GeronimoSingletonService.java:[25,33]
cannot find symbol
> symbol  : class WebBeansContext
> location: package org.apache.webbeans.config
>
> /home/geronimo/geronimo/trunk/plugins/openwebbeans/geronimo-openwebbeans/src/main/java/org/apache/geronimo/openwebbeans/GeronimoSingletonService.java:[36,37]
cannot find symbol
> symbol  : class WebBeansContext
> location: class org.apache.geronimo.openwebbeans.GeronimoSingletonService
>
> /home/geronimo/geronimo/trunk/plugins/openwebbeans/geronimo-openwebbeans/src/main/java/org/apache/geronimo/openwebbeans/GeronimoSingletonService.java:[47,49]
cannot find symbol
> symbol  : class WebBeansContext
> location: class org.apache.geronimo.openwebbeans.GeronimoSingletonService
>
> /home/geronimo/geronimo/trunk/plugins/openwebbeans/geronimo-openwebbeans/src/main/java/org/apache/geronimo/openwebbeans/GeronimoSingletonService.java:[47,18]
cannot find symbol
> symbol  : class WebBeansContext
> location: class org.apache.geronimo.openwebbeans.GeronimoSingletonService
>
> /home/geronimo/geronimo/trunk/plugins/openwebbeans/geronimo-openwebbeans/src/main/java/org/apache/geronimo/openwebbeans/GeronimoSingletonService.java:[53,37]
cannot find symbol
> symbol  : class WebBeansContext
> location: class org.apache.geronimo.openwebbeans.GeronimoSingletonService
>
> /home/geronimo/geronimo/trunk/plugins/openwebbeans/geronimo-openwebbeans/src/main/java/org/apache/geronimo/openwebbeans/GeronimoSingletonService.java:[63,12]
cannot find symbol
> symbol  : class WebBeansContext
> location: class org.apache.geronimo.openwebbeans.GeronimoSingletonService
>
> /home/geronimo/geronimo/trunk/plugins/openwebbeans/geronimo-openwebbeans/src/main/java/org/apache/geronimo/openwebbeans/SharedOwbContext.java:[23,33]
cannot find symbol
> symbol  : class WebBeansContext
> location: package org.apache.webbeans.config
>
> /home/geronimo/geronimo/trunk/plugins/openwebbeans/geronimo-openwebbeans/src/main/java/org/apache/geronimo/openwebbeans/SharedOwbContext.java:[30,4]
cannot find symbol
> symbol  : class WebBeansContext
> location: interface org.apache.geronimo.openwebbeans.SharedOwbContext
>
> /home/geronimo/geronimo/trunk/plugins/openwebbeans/geronimo-openwebbeans/src/main/java/org/apache/geronimo/openwebbeans/OpenWebBeansWebInitializer.java:[25,33]
cannot find symbol
> symbol  : class WebBeansContext
> location: package org.apache.webbeans.config
>
> /home/geronimo/geronimo/trunk/plugins/openwebbeans/geronimo-openwebbeans/src/main/java/org/apache/geronimo/openwebbeans/OpenWebBeansWebInitializer.java:[43,38]
cannot find symbol
> symbol  : class WebBeansContext
> location: class org.apache.geronimo.openwebbeans.OpenWebBeansWebInitializer
>
> /home/geronimo/geronimo/trunk/plugins/openwebbeans/geronimo-openwebbeans/src/main/java/org/apache/geronimo/openwebbeans/GeronimoSingletonService.java:[36,81]
cannot find symbol
> symbol  : class WebBeansContext
> location: class org.apache.geronimo.openwebbeans.GeronimoSingletonService
>
> /home/geronimo/geronimo/trunk/plugins/openwebbeans/geronimo-openwebbeans/src/main/java/org/apache/geronimo/openwebbeans/GeronimoSingletonService.java:[48,14]
cannot find symbol
> symbol  : class WebBeansContext
> location: class org.apache.geronimo.openwebbeans.GeronimoSingletonService
>
> /home/geronimo/geronimo/trunk/plugins/openwebbeans/geronimo-openwebbeans/src/main/java/org/apache/geronimo/openwebbeans/GeronimoSingletonService.java:[59,8]
cannot find symbol
> symbol  : class WebBeansContext
> location: class org.apache.geronimo.openwebbeans.GeronimoSingletonService
>
> /home/geronimo/geronimo/trunk/plugins/openwebbeans/geronimo-openwebbeans/src/main/java/org/apache/geronimo/openwebbeans/GeronimoSingletonService.java:[64,8]
cannot find symbol
> symbol  : class WebBeansContext
> location: class org.apache.geronimo.openwebbeans.GeronimoSingletonService
>
>
> [INFO] ------------------------------------------------------------------------
> [INFO] Trace
> org.apache.maven.BuildFailureException: Compilation failure
>        at org.apache.maven.lifecycle.DefaultLifecycleExecutor.executeGoals(DefaultLifecycleExecutor.java:715)
>        at org.apache.maven.lifecycle.DefaultLifecycleExecutor.executeGoalWithLifecycle(DefaultLifecycleExecutor.java:556)
>        at org.apache.maven.lifecycle.DefaultLifecycleExecutor.executeGoal(DefaultLifecycleExecutor.java:535)
>        at org.apache.maven.lifecycle.DefaultLifecycleExecutor.executeGoalAndHandleFailures(DefaultLifecycleExecutor.java:387)
>        at org.apache.maven.lifecycle.DefaultLifecycleExecutor.executeTaskSegments(DefaultLifecycleExecutor.java:348)
>        at org.apache.maven.lifecycle.DefaultLifecycleExecutor.execute(DefaultLifecycleExecutor.java:180)
>        at org.apache.maven.DefaultMaven.doExecute(DefaultMaven.java:328)
>        at org.apache.maven.DefaultMaven.execute(DefaultMaven.java:138)
>        at org.apache.maven.cli.MavenCli.main(MavenCli.java:362)
>        at org.apache.maven.cli.compat.CompatibleMain.main(CompatibleMain.java:60)
>        at sun.reflect.NativeMethodAccessorImpl.invoke0(Native Method)
>        at sun.reflect.NativeMethodAccessorImpl.invoke(NativeMethodAccessorImpl.java:39)
>        at sun.reflect.DelegatingMethodAccessorImpl.invoke(DelegatingMethodAccessorImpl.java:25)
>        at java.lang.reflect.Method.invoke(Method.java:597)
>        at org.codehaus.classworlds.Launcher.launchEnhanced(Launcher.java:315)
>        at org.codehaus.classworlds.Launcher.launch(Launcher.java:255)
>        at org.codehaus.classworlds.Launcher.mainWithExitCode(Launcher.java:430)
>        at org.codehaus.classworlds.Launcher.main(Launcher.java:375)
> Caused by: org.apache.maven.plugin.CompilationFailureException: Compilation failure
>        at org.apache.maven.plugin.AbstractCompilerMojo.execute(AbstractCompilerMojo.java:516)
>        at org.apache.maven.plugin.CompilerMojo.execute(CompilerMojo.java:114)
>        at org.apache.maven.plugin.DefaultPluginManager.executeMojo(DefaultPluginManager.java:490)
>        at org.apache.maven.lifecycle.DefaultLifecycleExecutor.executeGoals(DefaultLifecycleExecutor.java:694)
>        ... 17 more
> [INFO] ------------------------------------------------------------------------
> [INFO] Total time: 18 minutes 45 seconds
> [INFO] Finished at: Fri Dec 03 03:20:02 EST 2010
> [INFO] Final Memory: 329M/764M
> [INFO] ------------------------------------------------------------------------
>



-- 
Shawn

Mime
View raw message