geronimo-dev mailing list archives

Site index · List index
Message view « Date » · « Thread »
Top « Date » · « Thread »
From ga...@apache.org
Subject [BUILD] branches/2.1: Failed for Revision: 1054194
Date Sat, 01 Jan 2011 18:45:52 GMT
Geronimo Revision: 1054194 built with tests included
 
See the full build-0200.log file at http://people.apache.org/builds/geronimo/server/binaries/2.1/20110101/build-0200.log
 
Download the binaries from http://people.apache.org/builds/geronimo/server/binaries/2.1/20110101
[INFO] BUILD SUCCESSFUL
[INFO] ------------------------------------------------------------------------
[INFO] Total time: 140 minutes 34 seconds
[INFO] Finished at: Sat Jan 01 12:17:11 EST 2011
[INFO] Final Memory: 314M/870M
[INFO] ------------------------------------------------------------------------
 
TESTSUITE RESULTS (Failures only)
=================================
 
Assembly: tomcat
=================================
See full test results and logs at http://people.apache.org/builds/geronimo/server/binaries/2.1/20110101/logs-0200-tomcat/
 
[INFO] Running security-testsuite.security
[INFO] Tests run: 36, Failures: 1, Errors: 0, Skipped: 0, Time elapsed: 61.805 sec <<<
FAILURE!
 
Assembly: jetty
=================================
See full test results and logs at http://people.apache.org/builds/geronimo/server/binaries/2.1/20110101/logs-0200-jetty/
 
 
[INFO] [INFO] [ianal:verify-legal-files {execution: default}]
[INFO] [WARNING] Skipping verification of legal files in artifacts:
[INFO] [WARNING]     org.apache.geronimo.testsuite:basic:jar:2.1.8-SNAPSHOT
[INFO] [INFO] [install:install {execution: default-install}]
[INFO] [INFO] Installing /home/geronimo/geronimo/2.1/testsuite/console-testsuite/basic/target/basic-2.1.8-SNAPSHOT.jar
to /home/geronimo/.m2/repository/org/apache/geronimo/testsuite/basic/2.1.8-SNAPSHOT/basic-2.1.8-SNAPSHOT.jar
[INFO] [INFO] [testsuite:generate-surefire-xml {execution: generate-surefire-xml}]
[INFO] [INFO] Updating directory: /home/geronimo/geronimo/2.1/testsuite/console-testsuite/target/surefire-reports
[INFO] [INFO] Loading surefire xml for xmlproperty: /home/geronimo/geronimo/2.1/testsuite/console-testsuite/basic/target/surefire-reports/TEST-console-testsuite.basic-console.xml
[INFO] [INFO] ------------------------------------------------------------------------
[INFO] [INFO] BUILD SUCCESSFUL
[INFO] [INFO] ------------------------------------------------------------------------
[INFO] [INFO] Total time: 2 minutes 3 seconds
[INFO] [INFO] Finished at: Sat Jan 01 13:58:54 EST 2011
[INFO] [INFO] Final Memory: 43M/531M
[INFO] [INFO] ------------------------------------------------------------------------
[INFO] Invoking: /home/geronimo/geronimo/2.1/testsuite/console-testsuite/advanced/pom.xml
[INFO] + Error stacktraces are turned on.
[INFO] [INFO] Scanning for projects...
[INFO] [INFO] ------------------------------------------------------------------------
[INFO] [INFO] Building Geronimo TestSuite :: Console Testsuite :: Advanced Tests
[INFO] [INFO]    task-segment: [install]
[INFO] [INFO] ------------------------------------------------------------------------
[INFO] [INFO] [genesis:validate-configuration {execution: default}]
[INFO] [INFO] [enforcer:enforce {execution: default}]
[INFO] [INFO] Setting property: classpath.resource.loader.class => 'org.codehaus.plexus.velocity.ContextClassLoaderResourceLoader'.
[INFO] [INFO] Setting property: velocimacro.messages.on => 'false'.
[INFO] [INFO] Setting property: resource.loader => 'classpath'.
[INFO] [INFO] Setting property: resource.manager.logwhenfound => 'false'.
[INFO] [INFO] [remote-resources:process {execution: default}]
[INFO] [INFO] [resources:resources {execution: default-resources}]
[INFO] [INFO] Using 'UTF-8' encoding to copy filtered resources.
[INFO] [INFO] skip non existing resourceDirectory /home/geronimo/geronimo/2.1/testsuite/console-testsuite/advanced/src/main/resources
[INFO] [INFO] Copying 3 resources
[INFO] [INFO] [compiler:compile {execution: default-compile}]
[INFO] [INFO] No sources to compile
[INFO] [INFO] [resources:testResources {execution: default-testResources}]
[INFO] [INFO] Using 'UTF-8' encoding to copy filtered resources.
[INFO] [INFO] Copying 1 resource
[INFO] [INFO] skip non existing resourceDirectory /home/geronimo/geronimo/2.1/testsuite/console-testsuite/advanced/src/test/filtered-resources
[INFO] [INFO] Copying 3 resources
[INFO] [INFO] [compiler:testCompile {execution: default-testCompile}]
[INFO] [INFO] Compiling 8 source files to /home/geronimo/geronimo/2.1/testsuite/console-testsuite/advanced/target/test-classes
[INFO] [INFO] [surefire:test {execution: default-test}]
[INFO] [INFO] Tests are skipped.
[INFO] [INFO] [surefire:test {execution: test}]
[INFO] [INFO] Tests are skipped.
[INFO] [INFO] [jar:jar {execution: default-jar}]
[INFO] [INFO] Building jar: /home/geronimo/geronimo/2.1/testsuite/console-testsuite/advanced/target/advanced-2.1.8-SNAPSHOT.jar
[INFO] [INFO] [selenium:start-server {execution: start-server}]
[INFO] Created dir: /home/geronimo/geronimo/2.1/testsuite/console-testsuite/advanced/target/selenium
[INFO] Launching Selenium Server
[INFO] Waiting for Selenium Server...
[INFO] [WARNING] OS appears to be Unix and no DISPLAY environment variable has been detected.
Browser maybe unable to function correctly. Consider using the selenium:xvfb goal to enable
headless operation.
[INFO] [INFO] Redirecting output to: /home/geronimo/geronimo/2.1/testsuite/console-testsuite/advanced/target/selenium/server.log
[INFO] Selenium Server started
[INFO] [INFO] [surefire:test {execution: integration}]
[INFO] [INFO] User extensions: /home/geronimo/geronimo/2.1/testsuite/console-testsuite/advanced/target/selenium/user-extensions.js
[INFO] [INFO] Surefire report directory: /home/geronimo/geronimo/2.1/testsuite/console-testsuite/advanced/target/surefire-reports
[INFO] 
[INFO] -------------------------------------------------------
[INFO]  T E S T S
[INFO] -------------------------------------------------------
[INFO] Running console-testsuite.advance-test
[INFO] Tests run: 15, Failures: 0, Errors: 0, Skipped: 0, Time elapsed: 89.204 sec
[INFO] 
[INFO] Results :
[INFO] 
[INFO] Tests run: 15, Failures: 0, Errors: 0, Skipped: 0
[INFO] 
[INFO] Downloading: http://maven.rtp.raleigh.ibm.com/nexus-proxy//jline/jline/0.9.94/jline-0.9.94.jar
[INFO] Downloading: http://maven.rtp.raleigh.ibm.com/nexus-proxy//org/apache/ant/ant/1.7.1/ant-1.7.1.jar
[INFO] Downloading: http://maven.rtp.raleigh.ibm.com/nexus-proxy//org/slf4j/slf4j-api/1.5.0/slf4j-api-1.5.0.jar
[INFO] Downloading: http://maven.rtp.raleigh.ibm.com/nexus-proxy//org/codehaus/groovy/groovy-all-minimal/1.5.6/groovy-all-minimal-1.5.6.jar
[INFO] Downloading: http://maven.rtp.raleigh.ibm.com/nexus-proxy//org/codehaus/groovy/maven/feature/gmaven-feature-api/1.0-rc-3/gmaven-feature-api-1.0-rc-3.jar
[INFO] 16K downloaded  (slf4j-api-1.5.0.jar)
[INFO] Downloading: http://maven.rtp.raleigh.ibm.com/nexus-proxy//org/codehaus/groovy/maven/gmaven-mojo/1.0-rc-3/gmaven-mojo-1.0-rc-3.jar
[INFO] 11K downloaded  (gmaven-mojo-1.0-rc-3.jar)
[INFO] Downloading: http://maven.rtp.raleigh.ibm.com/nexus-proxy//org/codehaus/groovy/maven/runtime/gmaven-runtime-api/1.0-rc-3/gmaven-runtime-api-1.0-rc-3.jar
[INFO] 22K downloaded  (gmaven-runtime-api-1.0-rc-3.jar)
[INFO] 85K downloaded  (jline-0.9.94.jar)
[INFO] Downloading: http://maven.rtp.raleigh.ibm.com/nexus-proxy//com/thoughtworks/qdox/qdox/1.6.3/qdox-1.6.3.jar
[INFO] Downloading: http://maven.rtp.raleigh.ibm.com/nexus-proxy//org/codehaus/plexus/plexus-utils/1.1/plexus-utils-1.1.jar
[INFO] 164K downloaded  (plexus-utils-1.1.jar)
[INFO] 101K downloaded  (qdox-1.6.3.jar)
[INFO] Downloading: http://maven.rtp.raleigh.ibm.com/nexus-proxy//org/codehaus/groovy/maven/gmaven-common/1.0-rc-3/gmaven-common-1.0-rc-3.jar
[INFO] Downloading: http://maven.rtp.raleigh.ibm.com/nexus-proxy//org/codehaus/groovy/maven/runtime/gmaven-runtime-default/1.0-rc-3/gmaven-runtime-default-1.0-rc-3.jar
[INFO] 14K downloaded  (gmaven-common-1.0-rc-3.jar)
[INFO] 11K downloaded  (gmaven-runtime-default-1.0-rc-3.jar)
[INFO] Downloading: http://maven.rtp.raleigh.ibm.com/nexus-proxy//org/codehaus/groovy/maven/runtime/gmaven-runtime-1.5/1.0-rc-3/gmaven-runtime-1.5-1.0-rc-3.jar
[INFO] 45K downloaded  (gmaven-runtime-1.5-1.0-rc-3.jar)
[INFO] Downloading: http://maven.rtp.raleigh.ibm.com/nexus-proxy//org/codehaus/groovy/maven/runtime/gmaven-runtime-support/1.0-rc-3/gmaven-runtime-support-1.0-rc-3.jar
[INFO] 74K downloaded  (gmaven-runtime-support-1.0-rc-3.jar)
[INFO] 17K downloaded  (gmaven-feature-api-1.0-rc-3.jar)
[INFO] Downloading: http://maven.rtp.raleigh.ibm.com/nexus-proxy//org/codehaus/groovy/maven/feature/gmaven-feature-support/1.0-rc-3/gmaven-feature-support-1.0-rc-3.jar
[INFO] 15K downloaded  (gmaven-feature-support-1.0-rc-3.jar)
[INFO] 1291K downloaded  (ant-1.7.1.jar)
[INFO] Downloading: http://maven.rtp.raleigh.ibm.com/nexus-proxy//org/apache/ant/ant-launcher/1.7.1/ant-launcher-1.7.1.jar
[INFO] 11K downloaded  (ant-launcher-1.7.1.jar)
[INFO] 2744K downloaded  (groovy-all-minimal-1.5.6.jar)
[INFO] [INFO] ------------------------------------------------------------------------
[INFO] [ERROR] BUILD ERROR
[INFO] [INFO] ------------------------------------------------------------------------
[INFO] [INFO] Internal error in the plugin manager executing goal 'org.codehaus.mojo:ianal-maven-plugin:1.0-alpha-1:verify-legal-files':
Error adding plugin dependency 'org.codehaus.groovy.maven:gmaven-mojo:jar' into plugin manager:
Cannot add jar resource: /home/geronimo/.m2/repository/org/codehaus/groovy/maven/gmaven-mojo/1.0-rc-3/gmaven-mojo-1.0-rc-3.jar
(error discovering new components)
[INFO] error in opening zip file
[INFO] [INFO] ------------------------------------------------------------------------
[INFO] [INFO] Trace
[INFO] org.apache.maven.lifecycle.LifecycleExecutionException: Internal error in the plugin
manager executing goal 'org.codehaus.mojo:ianal-maven-plugin:1.0-alpha-1:verify-legal-files':
Error adding plugin dependency 'org.codehaus.groovy.maven:gmaven-mojo:jar' into plugin manager:
Cannot add jar resource: /home/geronimo/.m2/repository/org/codehaus/groovy/maven/gmaven-mojo/1.0-rc-3/gmaven-mojo-1.0-rc-3.jar
(error discovering new components)
[INFO] 	at org.apache.maven.lifecycle.DefaultLifecycleExecutor.executeGoals(DefaultLifecycleExecutor.java:698)
[INFO] 	at org.apache.maven.lifecycle.DefaultLifecycleExecutor.executeGoalWithLifecycle(DefaultLifecycleExecutor.java:556)
[INFO] 	at org.apache.maven.lifecycle.DefaultLifecycleExecutor.executeGoal(DefaultLifecycleExecutor.java:535)
[INFO] 	at org.apache.maven.lifecycle.DefaultLifecycleExecutor.executeGoalAndHandleFailures(DefaultLifecycleExecutor.java:387)
[INFO] 	at org.apache.maven.lifecycle.DefaultLifecycleExecutor.executeTaskSegments(DefaultLifecycleExecutor.java:348)
[INFO] 	at org.apache.maven.lifecycle.DefaultLifecycleExecutor.execute(DefaultLifecycleExecutor.java:180)
[INFO] 	at org.apache.maven.DefaultMaven.doExecute(DefaultMaven.java:328)
[INFO] 	at org.apache.maven.DefaultMaven.execute(DefaultMaven.java:138)
[INFO] 	at org.apache.maven.cli.MavenCli.main(MavenCli.java:362)
[INFO] 	at org.apache.maven.cli.compat.CompatibleMain.main(CompatibleMain.java:60)
[INFO] 	at sun.reflect.NativeMethodAccessorImpl.invoke0(Native Method)
[INFO] 	at sun.reflect.NativeMethodAccessorImpl.invoke(NativeMethodAccessorImpl.java:39)
[INFO] 	at sun.reflect.DelegatingMethodAccessorImpl.invoke(DelegatingMethodAccessorImpl.java:25)
[INFO] 	at java.lang.reflect.Method.invoke(Method.java:592)
[INFO] 	at org.codehaus.classworlds.Launcher.launchEnhanced(Launcher.java:315)
[INFO] 	at org.codehaus.classworlds.Launcher.launch(Launcher.java:255)
[INFO] 	at org.codehaus.classworlds.Launcher.mainWithExitCode(Launcher.java:430)
[INFO] 	at org.codehaus.classworlds.Launcher.main(Launcher.java:375)
[INFO] Caused by: org.apache.maven.plugin.PluginManagerException: Error adding plugin dependency
'org.codehaus.groovy.maven:gmaven-mojo:jar' into plugin manager: Cannot add jar resource:
/home/geronimo/.m2/repository/org/codehaus/groovy/maven/gmaven-mojo/1.0-rc-3/gmaven-mojo-1.0-rc-3.jar
(error discovering new components)
[INFO] 	at org.apache.maven.plugin.DefaultPluginManager.ensurePluginContainerIsComplete(DefaultPluginManager.java:857)
[INFO] 	at org.apache.maven.plugin.DefaultPluginManager.getConfiguredMojo(DefaultPluginManager.java:647)
[INFO] 	at org.apache.maven.plugin.DefaultPluginManager.executeMojo(DefaultPluginManager.java:468)
[INFO] 	at org.apache.maven.lifecycle.DefaultLifecycleExecutor.executeGoals(DefaultLifecycleExecutor.java:694)
[INFO] 	... 17 more
[INFO] Caused by: org.codehaus.plexus.PlexusContainerException: Cannot add jar resource: /home/geronimo/.m2/repository/org/codehaus/groovy/maven/gmaven-mojo/1.0-rc-3/gmaven-mojo-1.0-rc-3.jar
(error discovering new components)
[INFO] 	at org.codehaus.plexus.DefaultPlexusContainer.addJarResource(DefaultPlexusContainer.java:1405)
[INFO] 	at org.apache.maven.plugin.DefaultPluginManager.ensurePluginContainerIsComplete(DefaultPluginManager.java:853)
[INFO] 	... 20 more
[INFO] Caused by: org.codehaus.plexus.configuration.PlexusConfigurationException: Error reading
configuration jar:file:/home/geronimo/.m2/repository/org/codehaus/mojo/ianal-maven-plugin/1.0-alpha-1/ianal-maven-plugin-1.0-alpha-1.jar!/META-INF/maven/plugin.xml
[INFO] 	at org.codehaus.plexus.component.discovery.AbstractComponentDiscoverer.findComponents(AbstractComponentDiscoverer.java:89)
[INFO] 	at org.codehaus.plexus.DefaultPlexusContainer.discoverComponents(DefaultPlexusContainer.java:717)
[INFO] 	at org.codehaus.plexus.DefaultPlexusContainer.addJarResource(DefaultPlexusContainer.java:1396)
[INFO] 	... 21 more
[INFO] Caused by: java.util.zip.ZipException: error in opening zip file
[INFO] 	at java.util.zip.ZipFile.open(Native Method)
[INFO] 	at java.util.zip.ZipFile.<init>(ZipFile.java:203)
[INFO] 	at java.util.jar.JarFile.<init>(JarFile.java:132)
[INFO] 	at java.util.jar.JarFile.<init>(JarFile.java:70)
[INFO] 	at sun.net.www.protocol.jar.URLJarFile.<init>(URLJarFile.java:56)
[INFO] 	at sun.net.www.protocol.jar.URLJarFile.getJarFile(URLJarFile.java:41)
[INFO] 	at sun.net.www.protocol.jar.JarFileFactory.get(JarFileFactory.java:68)
[INFO] 	at sun.net.www.protocol.jar.JarURLConnection.connect(JarURLConnection.java:102)
[INFO] 	at org.codehaus.plexus.component.discovery.AbstractComponentDiscoverer.findComponents(AbstractComponentDiscoverer.java:72)
[INFO] 	... 23 more
[INFO] [INFO] ------------------------------------------------------------------------
[INFO] [INFO] Total time: 1 minute 52 seconds
[INFO] [INFO] Finished at: Sat Jan 01 14:00:48 EST 2011
[INFO] [INFO] Final Memory: 35M/541M
[INFO] [INFO] ------------------------------------------------------------------------
[INFO] ------------------------------------------------------------------------
[ERROR] BUILD ERROR
 
Samples: branches/2.1
=================================
Log: http://people.apache.org/builds/geronimo/server/binaries/2.1/20110101/samples-0200.log
 
Build status: FAILED
 

Mime
View raw message