geronimo-dev mailing list archives

Site index · List index
Message view « Date » · « Thread »
Top « Date » · « Thread »
From ga...@apache.org
Subject [BUILD] trunk: Failed for Revision: 1048974
Date Tue, 14 Dec 2010 09:03:29 GMT
Geronimo Revision: 1048974 built with tests included
 
See the full build-0300.log file at http://people.apache.org/builds/geronimo/server/binaries/trunk/20101214/build-0300.log
 
 
See the unit test reports at http://people.apache.org/builds/geronimo/server/binaries/trunk/20101214/unit-test-reports
 
[INFO] ------------------------------------------------------------------------
[INFO] Building Geronimo Plugins, MyFaces
[INFO]    task-segment: [install]
[INFO] ------------------------------------------------------------------------
[INFO] [genesis:validate-configuration {execution: default}]
[INFO] [geronimo-property:set-property {execution: set-property}]
[INFO] [enforcer:enforce {execution: default}]
[INFO] [remote-resources:process {execution: default}]
[INFO] [site:attach-descriptor {execution: default-attach-descriptor}]
[INFO] [geronimo-osgi:verify-manifest {execution: verify-manifest}]
[INFO] [ianal:verify-legal-files {execution: default}]
[INFO] [install:install {execution: default-install}]
[INFO] Installing /home/geronimo/geronimo/trunk/plugins/myfaces/pom.xml to /home/geronimo/.m2/repository/org/apache/geronimo/plugins/myfaces/3.0-SNAPSHOT/myfaces-3.0-SNAPSHOT.pom
[INFO] ------------------------------------------------------------------------
[INFO] Building Geronimo Plugins, MyFaces :: Core
[INFO]    task-segment: [install]
[INFO] ------------------------------------------------------------------------
[INFO] [genesis:validate-configuration {execution: default}]
[INFO] [geronimo-property:set-property {execution: set-property}]
[INFO] [enforcer:enforce {execution: default}]
[INFO] [remote-resources:process {execution: default}]
[INFO] [resources:resources {execution: default-resources}]
[INFO] Using 'UTF-8' encoding to copy filtered resources.
[INFO] skip non existing resourceDirectory /home/geronimo/geronimo/trunk/plugins/myfaces/geronimo-myfaces/src/main/resources
[INFO] skip non existing resourceDirectory /home/geronimo/geronimo/trunk/plugins/myfaces/geronimo-myfaces/src/main/filtered-resources
[INFO] Copying 3 resources
[INFO] [compiler:compile {execution: default-compile}]
[INFO] Compiling 16 source files to /home/geronimo/geronimo/trunk/plugins/myfaces/geronimo-myfaces/target/classes
[INFO] ------------------------------------------------------------------------
[ERROR] BUILD FAILURE
[INFO] ------------------------------------------------------------------------
[INFO] Compilation failure

/home/geronimo/geronimo/trunk/plugins/myfaces/geronimo-myfaces/src/main/java/org/apache/geronimo/myfaces/webapp/GeronimoStartupServletContextListener.java:[28,29]
cannot find symbol
symbol  : class FacesConfigurationMergerFactory
location: package org.apache.myfaces.spi

/home/geronimo/geronimo/trunk/plugins/myfaces/geronimo-myfaces/src/main/java/org/apache/geronimo/myfaces/info/GeronimoFacesConfigurationMergerFactory.java:[25,29]
cannot find symbol
symbol  : class FacesConfigurationMerger
location: package org.apache.myfaces.spi

/home/geronimo/geronimo/trunk/plugins/myfaces/geronimo-myfaces/src/main/java/org/apache/geronimo/myfaces/info/GeronimoFacesConfigurationMergerFactory.java:[26,29]
cannot find symbol
symbol  : class FacesConfigurationMergerFactory
location: package org.apache.myfaces.spi

/home/geronimo/geronimo/trunk/plugins/myfaces/geronimo-myfaces/src/main/java/org/apache/geronimo/myfaces/info/GeronimoFacesConfigurationMergerFactory.java:[33,61]
cannot find symbol
symbol: class FacesConfigurationMergerFactory
public class GeronimoFacesConfigurationMergerFactory extends FacesConfigurationMergerFactory
{

/home/geronimo/geronimo/trunk/plugins/myfaces/geronimo-myfaces/src/main/java/org/apache/geronimo/myfaces/info/GeronimoFacesConfigurationMergerFactory.java:[35,12]
cannot find symbol
symbol  : class FacesConfigurationMerger
location: class org.apache.geronimo.myfaces.info.GeronimoFacesConfigurationMergerFactory

/home/geronimo/geronimo/trunk/plugins/myfaces/geronimo-myfaces/src/main/java/org/apache/geronimo/myfaces/info/GeronimoFacesConfigurationMergerFactory.java:[38,11]
cannot find symbol
symbol  : class FacesConfigurationMerger
location: class org.apache.geronimo.myfaces.info.GeronimoFacesConfigurationMergerFactory

/home/geronimo/geronimo/trunk/plugins/myfaces/geronimo-myfaces/src/main/java/org/apache/geronimo/myfaces/webapp/GeronimoStartupServletContextListener.java:[51,36]
cannot find symbol
symbol  : class FacesConfigurationMergerFactory
location: class org.apache.geronimo.myfaces.webapp.GeronimoStartupServletContextListener

/home/geronimo/geronimo/trunk/plugins/myfaces/geronimo-myfaces/src/main/java/org/apache/geronimo/myfaces/info/GeronimoFacesConfigurationMergerFactory.java:[43,43]
cannot find symbol
symbol  : class FacesConfigurationMerger
location: class org.apache.geronimo.myfaces.info.GeronimoFacesConfigurationMergerFactory

/home/geronimo/geronimo/trunk/plugins/myfaces/geronimo-myfaces/src/main/java/org/apache/geronimo/myfaces/info/GeronimoFacesConfigurationMergerFactory.java:[37,4]
method does not override or implement a method from a supertype


[INFO] ------------------------------------------------------------------------
[INFO] Trace
org.apache.maven.BuildFailureException: Compilation failure
	at org.apache.maven.lifecycle.DefaultLifecycleExecutor.executeGoals(DefaultLifecycleExecutor.java:715)
	at org.apache.maven.lifecycle.DefaultLifecycleExecutor.executeGoalWithLifecycle(DefaultLifecycleExecutor.java:556)
	at org.apache.maven.lifecycle.DefaultLifecycleExecutor.executeGoal(DefaultLifecycleExecutor.java:535)
	at org.apache.maven.lifecycle.DefaultLifecycleExecutor.executeGoalAndHandleFailures(DefaultLifecycleExecutor.java:387)
	at org.apache.maven.lifecycle.DefaultLifecycleExecutor.executeTaskSegments(DefaultLifecycleExecutor.java:348)
	at org.apache.maven.lifecycle.DefaultLifecycleExecutor.execute(DefaultLifecycleExecutor.java:180)
	at org.apache.maven.DefaultMaven.doExecute(DefaultMaven.java:328)
	at org.apache.maven.DefaultMaven.execute(DefaultMaven.java:138)
	at org.apache.maven.cli.MavenCli.main(MavenCli.java:362)
	at org.apache.maven.cli.compat.CompatibleMain.main(CompatibleMain.java:60)
	at sun.reflect.NativeMethodAccessorImpl.invoke0(Native Method)
	at sun.reflect.NativeMethodAccessorImpl.invoke(NativeMethodAccessorImpl.java:39)
	at sun.reflect.DelegatingMethodAccessorImpl.invoke(DelegatingMethodAccessorImpl.java:25)
	at java.lang.reflect.Method.invoke(Method.java:597)
	at org.codehaus.classworlds.Launcher.launchEnhanced(Launcher.java:315)
	at org.codehaus.classworlds.Launcher.launch(Launcher.java:255)
	at org.codehaus.classworlds.Launcher.mainWithExitCode(Launcher.java:430)
	at org.codehaus.classworlds.Launcher.main(Launcher.java:375)
Caused by: org.apache.maven.plugin.CompilationFailureException: Compilation failure
	at org.apache.maven.plugin.AbstractCompilerMojo.execute(AbstractCompilerMojo.java:516)
	at org.apache.maven.plugin.CompilerMojo.execute(CompilerMojo.java:114)
	at org.apache.maven.plugin.DefaultPluginManager.executeMojo(DefaultPluginManager.java:490)
	at org.apache.maven.lifecycle.DefaultLifecycleExecutor.executeGoals(DefaultLifecycleExecutor.java:694)
	... 17 more
[INFO] ------------------------------------------------------------------------
[INFO] Total time: 44 minutes 15 seconds
[INFO] Finished at: Tue Dec 14 03:48:05 EST 2010
[INFO] Final Memory: 380M/954M
[INFO] ------------------------------------------------------------------------

Mime
View raw message