geronimo-dev mailing list archives

Site index · List index
Message view « Date » · « Thread »
Top « Date » · « Thread »
From ga...@apache.org
Subject [BUILD] branches/2.1: Failed for Revision: 1045022
Date Mon, 13 Dec 2010 16:42:22 GMT
Geronimo Revision: 1045022 built with tests included
 
See the full build-0200.log file at http://people.apache.org/builds/geronimo/server/binaries/2.1/20101213/build-0200.log
 
Download the binaries from http://people.apache.org/builds/geronimo/server/binaries/2.1/20101213
[INFO] BUILD SUCCESSFUL
[INFO] ------------------------------------------------------------------------
[INFO] Total time: 24 minutes 32 seconds
[INFO] Finished at: Mon Dec 13 08:40:49 EST 2010
[INFO] Final Memory: 278M/1005M
[INFO] ------------------------------------------------------------------------
 
TESTSUITE RESULTS (Failures only)
=================================
 
Assembly: tomcat
=================================
See full test results and logs at http://people.apache.org/builds/geronimo/server/binaries/2.1/20101213/logs-0200-tomcat/
 
[INFO] Running console-testsuite.basic-console
[INFO] Tests run: 49, Failures: 18, Errors: 0, Skipped: 15, Time elapsed: 60.644 sec <<<
FAILURE!
--
[INFO] Running security-testsuite.security
[INFO] Tests run: 36, Failures: 1, Errors: 0, Skipped: 0, Time elapsed: 61.34 sec <<<
FAILURE!
 
Assembly: jetty
=================================
See full test results and logs at http://people.apache.org/builds/geronimo/server/binaries/2.1/20101213/logs-0200-jetty/
 
[INFO] Running security-testsuite-generic-auth-test
[INFO] Tests run: 4, Failures: 3, Errors: 0, Skipped: 0, Time elapsed: 0.472 sec <<<
FAILURE!
 
Samples: branches/2.1
=================================
Log: http://people.apache.org/builds/geronimo/server/binaries/2.1/20101213/samples-0200.log
 
Build status: OK
 

Mime
View raw message