geronimo-dev mailing list archives

Site index · List index
Message view « Date » · « Thread »
Top « Date » · « Thread »
From ga...@apache.org
Subject [BUILD] branches/2.2: Failed for Revision: 1044185
Date Fri, 10 Dec 2010 00:50:37 GMT
Geronimo Revision: 1044185 built with tests included
 
See the full build-2000.log file at http://people.apache.org/builds/geronimo/server/binaries/2.2/20101209/build-2000.log
 
 
See the unit test reports at http://people.apache.org/builds/geronimo/server/binaries/2.2/20101209/unit-test-reports
 
[INFO] [car:prepare-metadata {execution: default-prepare-metadata}]
[WARNING] Component returned which is not the same manager. Ignored. component=org.apache.maven.profiles.activation.SystemPropertyProfileActivator@cb80cb8
[WARNING] Component returned which is not the same manager. Ignored. component=org.apache.maven.profiles.activation.FileProfileActivator@3740374
[INFO] [car:archive-car {execution: default-archive-car}]
[WARNING] Component returned which is not the same manager. Ignored. component=org.apache.maven.profiles.activation.SystemPropertyProfileActivator@cb80cb8
[WARNING] Component returned which is not the same manager. Ignored. component=org.apache.maven.profiles.activation.FileProfileActivator@3740374
[INFO] Building jar: /home/geronimo/geronimo/2.2/plugins/derby/derby/target/derby-2.2.2-SNAPSHOT.car
[INFO] [ianal:verify-legal-files {execution: default}]
[INFO] Checking legal files in: derby-2.2.2-SNAPSHOT.car
[INFO] [install:install {execution: default-install}]
[INFO] Installing /home/geronimo/geronimo/2.2/plugins/derby/derby/target/derby-2.2.2-SNAPSHOT.car
to /home/geronimo/.m2/repository/org/apache/geronimo/configs/derby/2.2.2-SNAPSHOT/derby-2.2.2-SNAPSHOT.car
[INFO] [car:update-pluginlist {execution: default-update-pluginlist}]
[INFO] ------------------------------------------------------------------------
[INFO] Building Geronimo Plugins, System Database
[INFO]    task-segment: [install]
[INFO] ------------------------------------------------------------------------
[INFO] [genesis:validate-configuration {execution: default}]
[INFO] [enforcer:enforce {execution: default}]
[INFO] [remote-resources:process {execution: default}]
[INFO] [site:attach-descriptor {execution: default-attach-descriptor}]
[INFO] [ianal:verify-legal-files {execution: default}]
[INFO] [install:install {execution: default-install}]
[INFO] Installing /home/geronimo/geronimo/2.2/plugins/system-database/pom.xml to /home/geronimo/.m2/repository/org/apache/geronimo/plugins/system-database/2.2.2-SNAPSHOT/system-database-2.2.2-SNAPSHOT.pom
[INFO] ------------------------------------------------------------------------
[INFO] Building Geronimo Plugins, System Database :: System Database
[INFO]    task-segment: [install]
[INFO] ------------------------------------------------------------------------
[INFO] [genesis:validate-configuration {execution: default}]
Downloading: http://maven.rtp.raleigh.ibm.com/nexus-proxy//org/tranql/tranql-connector-derby-embed-xa/1.7/tranql-connector-derby-embed-xa-1.7.pom
1K downloaded  (tranql-connector-derby-embed-xa-1.7.pom)
[WARNING] Component returned which is not the same manager. Ignored. component=org.apache.maven.profiles.activation.SystemPropertyProfileActivator@cb80cb8
[WARNING] Component returned which is not the same manager. Ignored. component=org.apache.maven.profiles.activation.FileProfileActivator@3740374
Downloading: http://maven.rtp.raleigh.ibm.com/nexus-proxy//org/tranql/tranql-connector-derby/1.7/tranql-connector-derby-1.7.pom
2K downloaded  (tranql-connector-derby-1.7.pom)
Downloading: http://maven.rtp.raleigh.ibm.com/nexus-proxy//org/tranql/tranql-connector-parent/1.8/tranql-connector-parent-1.8.pom
17K downloaded  (tranql-connector-parent-1.8.pom)
[WARNING] Component returned which is not the same manager. Ignored. component=org.apache.maven.profiles.activation.SystemPropertyProfileActivator@cb80cb8
[WARNING] Component returned which is not the same manager. Ignored. component=org.apache.maven.profiles.activation.FileProfileActivator@3740374
Downloading: http://maven.rtp.raleigh.ibm.com/nexus-proxy//org/tranql/tranql-connector-derby-embed-xa/1.7/tranql-connector-derby-embed-xa-1.7.rar
96K downloaded  (tranql-connector-derby-embed-xa-1.7.rar)
[INFO] [enforcer:enforce {execution: default}]
[INFO] [remote-resources:process {execution: default}]
[INFO] [resources:resources {execution: default-resources}]
[INFO] Using 'UTF-8' encoding to copy filtered resources.
[INFO] skip non existing resourceDirectory /home/geronimo/geronimo/2.2/plugins/system-database/system-database/src/main/resources
[INFO] skip non existing resourceDirectory /home/geronimo/geronimo/2.2/plugins/system-database/system-database/src/main/filtered-resources
[INFO] Copying 3 resources
[INFO] [car:validate-configuration {execution: default-validate-configuration}]
[INFO] [car:prepare-plan {execution: default-prepare-plan}]
[WARNING] Component returned which is not the same manager. Ignored. component=org.apache.maven.profiles.activation.SystemPropertyProfileActivator@cb80cb8
[WARNING] Component returned which is not the same manager. Ignored. component=org.apache.maven.profiles.activation.FileProfileActivator@3740374
[INFO] Generated: /home/geronimo/geronimo/2.2/plugins/system-database/system-database/target/work/plan.xml
[INFO] [car:verify-no-dependency-change {execution: default-verify-no-dependency-change}]
[WARNING] Component returned which is not the same manager. Ignored. component=org.apache.maven.profiles.activation.SystemPropertyProfileActivator@cb80cb8
[WARNING] Component returned which is not the same manager. Ignored. component=org.apache.maven.profiles.activation.FileProfileActivator@3740374
[INFO] ------------------------------------------------------------------------
[ERROR] BUILD FAILURE
[INFO] ------------------------------------------------------------------------
[INFO] Dependencies have changed:
	Added dependencies are saved here: /home/geronimo/geronimo/2.2/plugins/system-database/system-database/src/main/history/dependencies.added.xml
	Tree listing is saved here: /home/geronimo/geronimo/2.2/plugins/system-database/system-database/src/main/history/treeListing.txt
Delete /home/geronimo/geronimo/2.2/plugins/system-database/system-database/src/main/history/dependencies.xml
if you are happy with the dependency changes.
[INFO] ------------------------------------------------------------------------
[INFO] Trace
org.apache.maven.BuildFailureException: Dependencies have changed:
	Added dependencies are saved here: /home/geronimo/geronimo/2.2/plugins/system-database/system-database/src/main/history/dependencies.added.xml
	Tree listing is saved here: /home/geronimo/geronimo/2.2/plugins/system-database/system-database/src/main/history/treeListing.txt
Delete /home/geronimo/geronimo/2.2/plugins/system-database/system-database/src/main/history/dependencies.xml
if you are happy with the dependency changes.
	at org.apache.maven.lifecycle.DefaultLifecycleExecutor.executeGoals(DefaultLifecycleExecutor.java:715)
	at org.apache.maven.lifecycle.DefaultLifecycleExecutor.executeGoalWithLifecycle(DefaultLifecycleExecutor.java:556)
	at org.apache.maven.lifecycle.DefaultLifecycleExecutor.executeGoal(DefaultLifecycleExecutor.java:535)
	at org.apache.maven.lifecycle.DefaultLifecycleExecutor.executeGoalAndHandleFailures(DefaultLifecycleExecutor.java:387)
	at org.apache.maven.lifecycle.DefaultLifecycleExecutor.executeTaskSegments(DefaultLifecycleExecutor.java:348)
	at org.apache.maven.lifecycle.DefaultLifecycleExecutor.execute(DefaultLifecycleExecutor.java:180)
	at org.apache.maven.DefaultMaven.doExecute(DefaultMaven.java:328)
	at org.apache.maven.DefaultMaven.execute(DefaultMaven.java:138)
	at org.apache.maven.cli.MavenCli.main(MavenCli.java:362)
	at org.apache.maven.cli.compat.CompatibleMain.main(CompatibleMain.java:60)
	at sun.reflect.NativeMethodAccessorImpl.invoke0(Native Method)
	at sun.reflect.NativeMethodAccessorImpl.invoke(NativeMethodAccessorImpl.java:79)
	at sun.reflect.DelegatingMethodAccessorImpl.invoke(DelegatingMethodAccessorImpl.java:43)
	at java.lang.reflect.Method.invoke(Method.java:618)
	at org.codehaus.classworlds.Launcher.launchEnhanced(Launcher.java:315)
	at org.codehaus.classworlds.Launcher.launch(Launcher.java:255)
	at org.codehaus.classworlds.Launcher.mainWithExitCode(Launcher.java:430)
	at org.codehaus.classworlds.Launcher.main(Launcher.java:375)
Caused by: org.apache.maven.plugin.MojoFailureException: Dependencies have changed:
	Added dependencies are saved here: /home/geronimo/geronimo/2.2/plugins/system-database/system-database/src/main/history/dependencies.added.xml
	Tree listing is saved here: /home/geronimo/geronimo/2.2/plugins/system-database/system-database/src/main/history/treeListing.txt
Delete /home/geronimo/geronimo/2.2/plugins/system-database/system-database/src/main/history/dependencies.xml
if you are happy with the dependency changes.
	at org.apache.geronimo.mavenplugins.car.DependencyChangeMojo.saveDependencyChanges(DependencyChangeMojo.java:155)
	at org.apache.geronimo.mavenplugins.car.DependencyChangeMojo.execute(DependencyChangeMojo.java:114)
	at org.apache.maven.plugin.DefaultPluginManager.executeMojo(DefaultPluginManager.java:490)
	at org.apache.maven.lifecycle.DefaultLifecycleExecutor.executeGoals(DefaultLifecycleExecutor.java:694)
	... 17 more
[INFO] ------------------------------------------------------------------------
[INFO] Total time: 8 minutes 28 seconds
[INFO] Finished at: Thu Dec 09 20:11:45 EST 2010
[INFO] Final Memory: 192M/600M
[INFO] ------------------------------------------------------------------------

Mime
View raw message