geronimo-dev mailing list archives

Site index · List index
Message view « Date » · « Thread »
Top « Date » · « Thread »
From ga...@apache.org
Subject [BUILD] trunk: Failed for Revision: 1038794
Date Wed, 24 Nov 2010 20:31:27 GMT
Geronimo Revision: 1038794 built with tests included
 
See the full build-1500.log file at http://people.apache.org/builds/geronimo/server/binaries/trunk/20101124/build-1500.log
 
 
See the unit test reports at http://people.apache.org/builds/geronimo/server/binaries/trunk/20101124/unit-test-reports
 
[INFO] Unable to find resource 'org.apache.myfaces.core:myfaces-api:jar:2.0.2' in repository
openqa-releases (http://nexus.openqa.org/content/repositories/releases)
Downloading: http://maven.rtp.raleigh.ibm.com/nexus-proxy//org/apache/myfaces/core/myfaces-api/2.0.2/myfaces-api-2.0.2.jar
[INFO] Unable to find resource 'org.apache.geronimo.bundles:commons-discovery:jar:0.4_1' in
repository openqa-releases (http://nexus.openqa.org/content/repositories/releases)
Downloading: http://maven.rtp.raleigh.ibm.com/nexus-proxy//org/apache/geronimo/bundles/commons-discovery/0.4_1/commons-discovery-0.4_1.jar
78K downloaded  (commons-discovery-0.4_1.jar)
[INFO] Unable to find resource 'org.apache.servicemix.bundles:org.apache.servicemix.bundles.dom4j:jar:1.6.1_2'
in repository openqa-releases (http://nexus.openqa.org/content/repositories/releases)
Downloading: http://maven.rtp.raleigh.ibm.com/nexus-proxy//org/apache/servicemix/bundles/org.apache.servicemix.bundles.dom4j/1.6.1_2/org.apache.servicemix.bundles.dom4j-1.6.1_2.jar
Downloading: http://repository.apache.org/snapshots/org/apache/openwebbeans/openwebbeans-osgi/1.1.0-SNAPSHOT/openwebbeans-osgi-1.1.0-20101028.164844-2.jar
824K downloaded  (myfaces-api-2.0.2.jar)
Downloading: file:///home/geronimo/.m2/jtidy.repository/org/apache/myfaces/core/myfaces-impl/2.0.2/myfaces-impl-2.0.2.jar
[INFO] Unable to find resource 'org.apache.myfaces.core:myfaces-impl:jar:2.0.2' in repository
local (file:///home/geronimo/.m2/jtidy.repository)
Downloading: http://oss.sonatype.org/content/groups/jetty-with-staging/org/apache/myfaces/core/myfaces-impl/2.0.2/myfaces-impl-2.0.2.jar
313K downloaded  (org.apache.servicemix.bundles.dom4j-1.6.1_2.jar)
[INFO] Unable to find resource 'org.apache.myfaces.core:myfaces-impl:jar:2.0.2' in repository
jetty.oss.sonatype.org (http://oss.sonatype.org/content/groups/jetty-with-staging)
Downloading: http://svn.apache.org/repos/asf/servicemix/m2-repo//org/apache/myfaces/core/myfaces-impl/2.0.2/myfaces-impl-2.0.2.jar
13K downloaded  (openwebbeans-osgi-1.1.0-20101028.164844-2.jar)
Downloading: http://repository.apache.org/snapshots/org/apache/openwebbeans/openwebbeans-resource/1.1.0-SNAPSHOT/openwebbeans-resource-1.1.0-20101028.164844-2.jar
[INFO] Unable to find resource 'org.apache.myfaces.core:myfaces-impl:jar:2.0.2' in repository
smx.svn (http://svn.apache.org/repos/asf/servicemix/m2-repo/)
Downloading: http://download.java.net/maven/1//org.apache.myfaces.core/jars/myfaces-impl-2.0.2.jar
12K downloaded  (openwebbeans-resource-1.1.0-20101028.164844-2.jar)
[INFO] Unable to find resource 'org.apache.myfaces.core:myfaces-impl:jar:2.0.2' in repository
java.net (http://download.java.net/maven/1/)
Downloading: http://nexus.openqa.org/content/repositories/releases/org/apache/myfaces/core/myfaces-impl/2.0.2/myfaces-impl-2.0.2.jar
[INFO] Unable to find resource 'org.apache.myfaces.core:myfaces-impl:jar:2.0.2' in repository
openqa-releases (http://nexus.openqa.org/content/repositories/releases)
Downloading: http://maven.rtp.raleigh.ibm.com/nexus-proxy//org/apache/myfaces/core/myfaces-impl/2.0.2/myfaces-impl-2.0.2.jar
1611K downloaded  (myfaces-impl-2.0.2.jar)
[INFO] [enforcer:enforce {execution: default}]
[INFO] [remote-resources:process {execution: default}]
[INFO] [resources:resources {execution: default-resources}]
[INFO] Using 'UTF-8' encoding to copy filtered resources.
[INFO] Copying 1 resource
[INFO] skip non existing resourceDirectory /home/geronimo/geronimo/trunk/plugins/openwebbeans/geronimo-openwebbeans/src/main/filtered-resources
[INFO] Copying 3 resources
[INFO] [compiler:compile {execution: default-compile}]
[INFO] Compiling 8 source files to /home/geronimo/geronimo/trunk/plugins/openwebbeans/geronimo-openwebbeans/target/classes
[INFO] ------------------------------------------------------------------------
[ERROR] BUILD FAILURE
[INFO] ------------------------------------------------------------------------
[INFO] Compilation failure

/home/geronimo/geronimo/trunk/plugins/openwebbeans/geronimo-openwebbeans/src/main/java/org/apache/geronimo/openwebbeans/OsgiMetaDataScannerService.java:[22,37]
cannot find symbol
symbol  : class DefaultBDABeansXmlScanner
location: package org.apache.webbeans.corespi.se

/home/geronimo/geronimo/trunk/plugins/openwebbeans/geronimo-openwebbeans/src/main/java/org/apache/geronimo/openwebbeans/OsgiMetaDataScannerService.java:[25,30]
cannot find symbol
symbol  : class BDABeansXmlScanner
location: package org.apache.webbeans.spi

/home/geronimo/geronimo/trunk/plugins/openwebbeans/geronimo-openwebbeans/src/main/java/org/apache/geronimo/openwebbeans/OsgiMetaDataScannerService.java:[62,14]
cannot find symbol
symbol  : class BDABeansXmlScanner
location: class org.apache.geronimo.openwebbeans.OsgiMetaDataScannerService

/home/geronimo/geronimo/trunk/plugins/openwebbeans/geronimo-openwebbeans/src/main/java/org/apache/geronimo/openwebbeans/OsgiMetaDataScannerService.java:[242,11]
cannot find symbol
symbol  : class BDABeansXmlScanner
location: class org.apache.geronimo.openwebbeans.OsgiMetaDataScannerService

/home/geronimo/geronimo/trunk/plugins/openwebbeans/geronimo-openwebbeans/src/main/java/org/apache/geronimo/openwebbeans/OsgiMetaDataScannerService.java:[79,100]
cannot find symbol
symbol  : variable USE_BDA_BEANSXML_SCANNER
location: class org.apache.webbeans.config.OpenWebBeansConfiguration

/home/geronimo/geronimo/trunk/plugins/openwebbeans/geronimo-openwebbeans/src/main/java/org/apache/geronimo/openwebbeans/OsgiMetaDataScannerService.java:[83,37]
cannot find symbol
symbol  : class DefaultBDABeansXmlScanner
location: class org.apache.geronimo.openwebbeans.OsgiMetaDataScannerService

/home/geronimo/geronimo/trunk/plugins/openwebbeans/geronimo-openwebbeans/src/main/java/org/apache/geronimo/openwebbeans/OsgiMetaDataScannerService.java:[235,4]
method does not override or implement a method from a supertype

/home/geronimo/geronimo/trunk/plugins/openwebbeans/geronimo-openwebbeans/src/main/java/org/apache/geronimo/openwebbeans/OsgiMetaDataScannerService.java:[241,4]
method does not override or implement a method from a supertype


[INFO] ------------------------------------------------------------------------
[INFO] Trace
org.apache.maven.BuildFailureException: Compilation failure
	at org.apache.maven.lifecycle.DefaultLifecycleExecutor.executeGoals(DefaultLifecycleExecutor.java:715)
	at org.apache.maven.lifecycle.DefaultLifecycleExecutor.executeGoalWithLifecycle(DefaultLifecycleExecutor.java:556)
	at org.apache.maven.lifecycle.DefaultLifecycleExecutor.executeGoal(DefaultLifecycleExecutor.java:535)
	at org.apache.maven.lifecycle.DefaultLifecycleExecutor.executeGoalAndHandleFailures(DefaultLifecycleExecutor.java:387)
	at org.apache.maven.lifecycle.DefaultLifecycleExecutor.executeTaskSegments(DefaultLifecycleExecutor.java:348)
	at org.apache.maven.lifecycle.DefaultLifecycleExecutor.execute(DefaultLifecycleExecutor.java:180)
	at org.apache.maven.DefaultMaven.doExecute(DefaultMaven.java:328)
	at org.apache.maven.DefaultMaven.execute(DefaultMaven.java:138)
	at org.apache.maven.cli.MavenCli.main(MavenCli.java:362)
	at org.apache.maven.cli.compat.CompatibleMain.main(CompatibleMain.java:60)
	at sun.reflect.NativeMethodAccessorImpl.invoke0(Native Method)
	at sun.reflect.NativeMethodAccessorImpl.invoke(NativeMethodAccessorImpl.java:39)
	at sun.reflect.DelegatingMethodAccessorImpl.invoke(DelegatingMethodAccessorImpl.java:25)
	at java.lang.reflect.Method.invoke(Method.java:597)
	at org.codehaus.classworlds.Launcher.launchEnhanced(Launcher.java:315)
	at org.codehaus.classworlds.Launcher.launch(Launcher.java:255)
	at org.codehaus.classworlds.Launcher.mainWithExitCode(Launcher.java:430)
	at org.codehaus.classworlds.Launcher.main(Launcher.java:375)
Caused by: org.apache.maven.plugin.CompilationFailureException: Compilation failure
	at org.apache.maven.plugin.AbstractCompilerMojo.execute(AbstractCompilerMojo.java:516)
	at org.apache.maven.plugin.CompilerMojo.execute(CompilerMojo.java:114)
	at org.apache.maven.plugin.DefaultPluginManager.executeMojo(DefaultPluginManager.java:490)
	at org.apache.maven.lifecycle.DefaultLifecycleExecutor.executeGoals(DefaultLifecycleExecutor.java:694)
	... 17 more
[INFO] ------------------------------------------------------------------------
[INFO] Total time: 17 minutes 21 seconds
[INFO] Finished at: Wed Nov 24 15:18:37 EST 2010
[INFO] Final Memory: 331M/816M
[INFO] ------------------------------------------------------------------------

Mime
View raw message