geronimo-dev mailing list archives

Site index · List index
Message view « Date » · « Thread »
Top « Date » · « Thread »
From ga...@apache.org
Subject [BUILD] branches/2.2: Failed for Revision: 1032664
Date Fri, 12 Nov 2010 19:20:00 GMT
Geronimo Revision: 1032664 built with tests included
 
See the full build-1400.log file at http://people.apache.org/builds/geronimo/server/binaries/2.2/20101108/build-1400.log
 
Download the binaries from http://people.apache.org/builds/geronimo/server/binaries/2.2/20101108
[INFO] BUILD SUCCESSFUL
[INFO] ------------------------------------------------------------------------
[INFO] Total time: 54 minutes 32 seconds
[INFO] Finished at: Mon Nov 08 15:00:41 EST 2010
[INFO] Final Memory: 306M/1000M
[INFO] ------------------------------------------------------------------------
 
TESTSUITE RESULTS (Failures only)
=================================
 
Assembly: tomcat
=================================
See full test results and logs at http://people.apache.org/builds/geronimo/server/binaries/2.2/20101108/logs-1400-tomcat/
 
[INFO] Running TestSuite
[INFO] Tests run: 40, Failures: 24, Errors: 0, Skipped: 0, Time elapsed: 208.697 sec <<<
FAILURE!
[INFO] Running TestSuite
[INFO] Tests run: 12, Failures: 9, Errors: 0, Skipped: 0, Time elapsed: 78.252 sec <<<
FAILURE!
--
[INFO] Running TestSuite
[INFO] Tests run: 2, Failures: 2, Errors: 0, Skipped: 0, Time elapsed: 7.407 sec <<<
FAILURE!
--
[INFO] Running TestSuite
[INFO] Tests run: 36, Failures: 1, Errors: 0, Skipped: 0, Time elapsed: 71.21 sec <<<
FAILURE!
 
Assembly: jetty
=================================
See full test results and logs at http://people.apache.org/builds/geronimo/server/binaries/2.2/20101108/logs-1400-jetty/
 
[INFO] Running TestSuite
[INFO] Tests run: 116, Failures: 3, Errors: 0, Skipped: 113, Time elapsed: 17.086 sec <<<
FAILURE!
[INFO] Running TestSuite
[INFO] Tests run: 12, Failures: 7, Errors: 0, Skipped: 0, Time elapsed: 88.766 sec <<<
FAILURE!
--
[INFO] Running TestSuite
[INFO] Tests run: 2, Failures: 2, Errors: 0, Skipped: 0, Time elapsed: 8.206 sec <<<
FAILURE!
 
Samples: branches/2.2
=================================
Log: http://people.apache.org/builds/geronimo/server/binaries/2.2/20101108/samples-1400.log
 
Build status: FAILED
 

Mime
View raw message