geronimo-dev mailing list archives

Site index · List index
Message view « Date » · « Thread »
Top « Date » · « Thread »
From ga...@apache.org
Subject [BUILD] branches/2.2: Failed for Revision: 1032431
Date Mon, 08 Nov 2010 03:16:45 GMT
Geronimo Revision: 1032431 built with tests included
 
See the full build-2000.log file at http://people.apache.org/builds/geronimo/server/binaries/2.2/20101107/build-2000.log
 
Download the binaries from http://people.apache.org/builds/geronimo/server/binaries/2.2/20101107
[INFO] BUILD SUCCESSFUL
[INFO] ------------------------------------------------------------------------
[INFO] Total time: 35 minutes 30 seconds
[INFO] Finished at: Sun Nov 07 20:41:41 EST 2010
[INFO] Final Memory: 313M/935M
[INFO] ------------------------------------------------------------------------
 
TESTSUITE RESULTS (Failures only)
=================================
 
Assembly: tomcat
=================================
See full test results and logs at http://people.apache.org/builds/geronimo/server/binaries/2.2/20101107/logs-2000-tomcat/
 
[INFO] Running TestSuite
[INFO] Tests run: 40, Failures: 25, Errors: 0, Skipped: 0, Time elapsed: 212.549 sec <<<
FAILURE!
[INFO] Running TestSuite
[INFO] Tests run: 12, Failures: 7, Errors: 0, Skipped: 0, Time elapsed: 71.372 sec <<<
FAILURE!
--
[INFO] Running TestSuite
[INFO] Tests run: 2, Failures: 2, Errors: 0, Skipped: 0, Time elapsed: 7.955 sec <<<
FAILURE!
--
[INFO] Running TestSuite
[INFO] Tests run: 36, Failures: 1, Errors: 0, Skipped: 0, Time elapsed: 69.192 sec <<<
FAILURE!
 
Assembly: jetty
=================================
See full test results and logs at http://people.apache.org/builds/geronimo/server/binaries/2.2/20101107/logs-2000-jetty/
 
[INFO] Running TestSuite
[INFO] Tests run: 116, Failures: 3, Errors: 0, Skipped: 113, Time elapsed: 17.148 sec <<<
FAILURE!
[INFO] Running TestSuite
[INFO] Tests run: 12, Failures: 6, Errors: 0, Skipped: 0, Time elapsed: 85.619 sec <<<
FAILURE!
--
[INFO] Running TestSuite
[INFO] Tests run: 2, Failures: 2, Errors: 0, Skipped: 0, Time elapsed: 9.027 sec <<<
FAILURE!
 
[WARNING] 	at org.apache.geronimo.system.jmx.MBeanGBeanBridge.invoke(MBeanGBeanBridge.java:172)
[WARNING] 	at com.sun.jmx.mbeanserver.DynamicMetaDataImpl.invoke(DynamicMetaDataImpl.java:213)
[WARNING] 	at com.sun.jmx.mbeanserver.MetaDataImpl.invoke(MetaDataImpl.java:220)
[WARNING] 	at com.sun.jmx.interceptor.DefaultMBeanServerInterceptor.invoke(DefaultMBeanServerInterceptor.java:815)
[WARNING] 	at com.sun.jmx.mbeanserver.JmxMBeanServer.invoke(JmxMBeanServer.java:784)
[WARNING] 	at javax.management.remote.rmi.RMIConnectionImpl.doOperation(RMIConnectionImpl.java:1410)
[WARNING] 	at javax.management.remote.rmi.RMIConnectionImpl.access$100(RMIConnectionImpl.java:81)
[WARNING] 	at javax.management.remote.rmi.RMIConnectionImpl$PrivilegedOperation.run(RMIConnectionImpl.java:1247)
[WARNING] 	at java.security.AccessController.doPrivileged(Native Method)
[WARNING] 	at javax.management.remote.rmi.RMIConnectionImpl.doPrivilegedOperation(RMIConnectionImpl.java:1350)
[WARNING] 	at javax.management.remote.rmi.RMIConnectionImpl.invoke(RMIConnectionImpl.java:784)
[WARNING] 	at sun.reflect.GeneratedMethodAccessor24.invoke(Unknown Source)
[WARNING] 	at sun.reflect.DelegatingMethodAccessorImpl.invoke(DelegatingMethodAccessorImpl.java:25)
[WARNING] 	at java.lang.reflect.Method.invoke(Method.java:585)
[WARNING] 	at sun.rmi.server.UnicastServerRef.dispatch(UnicastServerRef.java:294)
[WARNING] 	at sun.rmi.transport.Transport$1.run(Transport.java:153)
[WARNING] 	at java.security.AccessController.doPrivileged(Native Method)
[WARNING] 	at sun.rmi.transport.Transport.serviceCall(Transport.java:149)
[WARNING] 	at sun.rmi.transport.tcp.TCPTransport.handleMessages(TCPTransport.java:466)
[WARNING] 	at sun.rmi.transport.tcp.TCPTransport$ConnectionHandler.run(TCPTransport.java:707)
[WARNING] 	at java.lang.Thread.run(Thread.java:595)
[INFO] [WARNING] Ignoring failure !
[INFO] [INFO] [failsafe:integration-test {execution: integration-test}]
[INFO] [INFO] Failsafe report directory: /home/geronimo/geronimo/2.2/testsuite/deployment-testsuite/jca-cms-tests/jca-cms-ear/target/failsafe-reports
[INFO] 
[INFO] -------------------------------------------------------
[INFO]  T E S T S
[INFO] -------------------------------------------------------
[INFO] Running TestSuite
[INFO] Tests run: 2, Failures: 2, Errors: 0, Skipped: 0, Time elapsed: 9.027 sec <<<
FAILURE!
[INFO] 
[INFO] Results :
[INFO] 
[INFO] Failed tests: 
[INFO]   testPageContent1(org.apache.geronimo.testsuite.jcacms.CmsTest)
[INFO]   testPageContent2(org.apache.geronimo.testsuite.jcacms.CmsTest)
[INFO] 
[INFO] Tests run: 2, Failures: 2, Errors: 0, Skipped: 0
[INFO] 
[INFO] [WARNING] File encoding has not been set, using platform encoding ANSI_X3.4-1968, i.e.
build is platform dependent!
[INFO] [INFO] [selenium:stop-server {execution: stop}]
[INFO] Stopping Selenium server...
[INFO] Stop request sent
[INFO] [INFO] [geronimo:undeploy-module {execution: undeploy-ear-as-module}]
[INFO] [INFO] Using non-artifact based module id: org.apache.geronimo.testsuite/jca-cms-ear/2.2.1-SNAPSHOT/ear
[INFO] [INFO] Module is already stopped: org.apache.geronimo.testsuite/jca-cms-ear/2.2.1-SNAPSHOT/ear
[INFO] [INFO] Module is not deployed: org.apache.geronimo.testsuite/jca-cms-ear/2.2.1-SNAPSHOT/ear
[INFO] [INFO] [failsafe:verify {execution: verify}]
[INFO] [INFO] Failsafe report directory: /home/geronimo/geronimo/2.2/testsuite/deployment-testsuite/jca-cms-tests/jca-cms-ear/target/failsafe-reports
[INFO] [WARNING] File encoding has not been set, using platform encoding ANSI_X3.4-1968, i.e.
build is platform dependent!
[INFO] [ERROR] There are test failures.
[INFO] 
[INFO] Please refer to /home/geronimo/geronimo/2.2/testsuite/deployment-testsuite/jca-cms-tests/jca-cms-ear/target/failsafe-reports
for the individual test results.
[INFO] [INFO] [ianal:verify-legal-files {execution: default}]
[INFO] [WARNING] Skipping verification of legal files in artifacts:
[INFO] [WARNING]     org.apache.geronimo.testsuite:jca-cms-ear:ear:2.2.1-SNAPSHOT
[INFO] [INFO] [install:install {execution: default-install}]
[INFO] [INFO] Installing /home/geronimo/geronimo/2.2/testsuite/deployment-testsuite/jca-cms-tests/jca-cms-ear/target/jca-cms-ear-2.2.1-SNAPSHOT.ear
to /home/geronimo/.m2/repository/org/apache/geronimo/testsuite/jca-cms-ear/2.2.1-SNAPSHOT/jca-cms-ear-2.2.1-SNAPSHOT.ear
[INFO] [INFO] 
[INFO] [INFO] 
[INFO] [INFO] ------------------------------------------------------------------------
[INFO] [INFO] Reactor Summary:
[INFO] [INFO] ------------------------------------------------------------------------
[INFO] [INFO] Geronimo TestSuite :: Deployment Testsuite :: J2CA Container Managed Security
Test  SUCCESS [7.274s]
[INFO] [INFO] Geronimo TestSuite :: Deployment Testsuite :: J2CA Container Managed Security
WAR  SUCCESS [2.261s]
[INFO] [INFO] Geronimo TestSuite :: Deployment Testsuite :: J2CA Container Managed Security
EAR  SUCCESS [23.258s]
[INFO] [INFO] ------------------------------------------------------------------------
[INFO] [INFO] ------------------------------------------------------------------------
[INFO] [INFO] BUILD SUCCESSFUL
[INFO] [INFO] ------------------------------------------------------------------------
[INFO] [INFO] Total time: 34 seconds
[INFO] [INFO] Finished at: Sun Nov 07 22:24:47 EST 2010
[INFO] [INFO] Final Memory: 52M/537M
[INFO] [INFO] ------------------------------------------------------------------------
[INFO] [ianal:verify-legal-files {execution: default}]
[INFO] [install:install {execution: default-install}]
[INFO] Installing /home/geronimo/geronimo/2.2/testsuite/deployment-testsuite/pom.xml to /home/geronimo/.m2/repository/org/apache/geronimo/testsuite/deployment-testsuite/2.2.1-SNAPSHOT/deployment-testsuite-2.2.1-SNAPSHOT.pom
[INFO] [geronimo:stop-server {execution: stop}]
[INFO] Stopping Geronimo server...
[INFO] ------------------------------------------------------------------------
[INFO] Building Geronimo TestSuite :: Enterprise Testsuite
[INFO]    task-segment: [install]
[INFO] ------------------------------------------------------------------------
[INFO] [genesis:validate-configuration {execution: default}]
[INFO] [enforcer:enforce {execution: default}]
[INFO] [remote-resources:process {execution: default}]
[INFO] [site:attach-descriptor {execution: default-attach-descriptor}]
[INFO] [install:install {execution: install-ahead}]
[INFO] Installing /home/geronimo/geronimo/2.2/testsuite/enterprise-testsuite/pom.xml to /home/geronimo/.m2/repository/org/apache/geronimo/testsuite/enterprise-testsuite/2.2.1-SNAPSHOT/enterprise-testsuite-2.2.1-SNAPSHOT.pom
[INFO] [geronimo:start-server {execution: start}]
[INFO] Using assembly configuration: jetty
[INFO] Using assembly artifact: org.apache.geronimo.assemblies:geronimo-jetty7-javaee5:zip:bin:2.2.1-SNAPSHOT:provided
[INFO] Using geronimoHome: /home/geronimo/geronimo/2.2/testsuite/enterprise-testsuite/target/geronimo-jetty7-javaee5-2.2.1-SNAPSHOT
[INFO] Installing assembly...
[INFO] Expanding: /home/geronimo/.m2/repository/org/apache/geronimo/assemblies/geronimo-jetty7-javaee5/2.2.1-SNAPSHOT/geronimo-jetty7-javaee5-2.2.1-SNAPSHOT-bin.zip
into /home/geronimo/geronimo/2.2/testsuite/enterprise-testsuite/target
[INFO] Starting Geronimo server...
[INFO] Selected option set: default
[INFO] Redirecting output to: /home/geronimo/geronimo/2.2/testsuite/enterprise-testsuite/target/geronimo-logs/org.apache.geronimo.mavenplugins.geronimo.server.StartServerMojo.log
[INFO] Waiting for Geronimo server...
[INFO] ------------------------------------------------------------------------
[ERROR] BUILD ERROR
 
Samples: branches/2.2
=================================
Log: http://people.apache.org/builds/geronimo/server/binaries/2.2/20101107/samples-2000.log
 
Build status: FAILED
 

Mime
View raw message