geronimo-dev mailing list archives

Site index · List index
Message view « Date » · « Thread »
Top « Date » · « Thread »
From ga...@apache.org
Subject [BUILD] trunk: Failed for Revision: 1029637
Date Mon, 01 Nov 2010 13:34:29 GMT
Geronimo Revision: 1029637 built with tests included
 
See the full build-0900.log file at http://people.apache.org/builds/geronimo/server/binaries/trunk/20101101/build-0900.log
 
 
See the unit test reports at http://people.apache.org/builds/geronimo/server/binaries/trunk/20101101/unit-test-reports
 
Running org.apache.geronimo.deployment.tools.ClientDeployableTest
Tests run: 1, Failures: 0, Errors: 0, Skipped: 0, Time elapsed: 0.586 sec
Running org.apache.geronimo.deployment.tools.DDBeanRootTest
Tests run: 1, Failures: 0, Errors: 0, Skipped: 0, Time elapsed: 0.035 sec
Running org.apache.geronimo.deployment.tools.WebDeployableTest
Tests run: 1, Failures: 0, Errors: 0, Skipped: 0, Time elapsed: 0.019 sec

Results :

Tests run: 3, Failures: 0, Errors: 0, Skipped: 0

[INFO] [bundle:bundle {execution: default-bundle}]
[INFO] [geronimo-osgi:verify-manifest {execution: verify-manifest}]
[INFO] Resolving OSGi bundle: org.apache.geronimo.modules.geronimo-test-ddbean
[INFO] OSGi bundle is resolved: org.apache.geronimo.modules.geronimo-test-ddbean
[INFO] [ianal:verify-legal-files {execution: default}]
[INFO] Checking legal files in: geronimo-test-ddbean-3.0-SNAPSHOT.jar
[INFO] [install:install {execution: default-install}]
[INFO] Installing /home/geronimo/geronimo/trunk/plugins/j2ee/geronimo-test-ddbean/target/geronimo-test-ddbean-3.0-SNAPSHOT.jar
to /home/geronimo/.m2/repository/org/apache/geronimo/modules/geronimo-test-ddbean/3.0-SNAPSHOT/geronimo-test-ddbean-3.0-SNAPSHOT.jar
[INFO] [bundle:install {execution: default-install}]
[INFO] Parsing file:/home/geronimo/.m2/repository/repository.xml
[INFO] Installing org/apache/geronimo/modules/geronimo-test-ddbean/3.0-SNAPSHOT/geronimo-test-ddbean-3.0-SNAPSHOT.jar
[INFO] Writing OBR metadata
[INFO] ------------------------------------------------------------------------
[INFO] Building Geronimo Plugins, J2EE :: Web 2.5 Builder
[INFO]    task-segment: [install]
[INFO] ------------------------------------------------------------------------
[INFO] [genesis:validate-configuration {execution: default}]
[INFO] [geronimo-property:set-property {execution: set-property}]
[INFO] snapshot org.apache.geronimo.modules:geronimo-web:3.0-SNAPSHOT: checking for updates
from jetty.oss.sonatype.org
[INFO] snapshot org.apache.geronimo.modules:geronimo-web:3.0-SNAPSHOT: checking for updates
from openqa-snapshots
[INFO] snapshot org.apache.geronimo.modules:geronimo-web:3.0-SNAPSHOT: checking for updates
from codehaus.snapshots
[INFO] snapshot org.apache.geronimo.modules:geronimo-web:3.0-SNAPSHOT: checking for updates
from apache.snapshots
[INFO] snapshot org.apache.geronimo.modules:geronimo-naming-builder:3.0-SNAPSHOT: checking
for updates from jetty.oss.sonatype.org
[INFO] snapshot org.apache.geronimo.modules:geronimo-naming-builder:3.0-SNAPSHOT: checking
for updates from openqa-snapshots
[INFO] snapshot org.apache.geronimo.modules:geronimo-naming-builder:3.0-SNAPSHOT: checking
for updates from codehaus.snapshots
[INFO] snapshot org.apache.geronimo.modules:geronimo-naming-builder:3.0-SNAPSHOT: checking
for updates from apache.snapshots
[INFO] snapshot org.apache.geronimo.modules:geronimo-security-builder:3.0-SNAPSHOT: checking
for updates from jetty.oss.sonatype.org
[INFO] snapshot org.apache.geronimo.modules:geronimo-security-builder:3.0-SNAPSHOT: checking
for updates from openqa-snapshots
[INFO] snapshot org.apache.geronimo.modules:geronimo-security-builder:3.0-SNAPSHOT: checking
for updates from codehaus.snapshots
[INFO] snapshot org.apache.geronimo.modules:geronimo-security-builder:3.0-SNAPSHOT: checking
for updates from apache.snapshots
[INFO] snapshot org.apache.geronimo.modules:geronimo-test-ddbean:3.0-SNAPSHOT: checking for
updates from jetty.oss.sonatype.org
[INFO] snapshot org.apache.geronimo.modules:geronimo-test-ddbean:3.0-SNAPSHOT: checking for
updates from openqa-snapshots
[INFO] snapshot org.apache.geronimo.modules:geronimo-test-ddbean:3.0-SNAPSHOT: checking for
updates from codehaus.snapshots
[INFO] snapshot org.apache.geronimo.modules:geronimo-test-ddbean:3.0-SNAPSHOT: checking for
updates from apache.snapshots
[INFO] [enforcer:enforce {execution: default}]
[INFO] [xmlbeans:xmlbeans {execution: default}]
IO Error java.net.ConnectException: Connection timed out
Time to build schema type system: 378.063 seconds
BUILD FAILED
[INFO] ------------------------------------------------------------------------
[ERROR] BUILD ERROR
[INFO] ------------------------------------------------------------------------
[INFO] XmlBeans compile failed:
 xml ErrorLoading schema file /home/geronimo/geronimo/trunk/plugins/j2ee/geronimo-web-2.5-builder/src/main/xsd/geronimo-web-2.0.1.xsd
xml ErrorLoading config file /home/geronimo/geronimo/trunk/plugins/j2ee/geronimo-web-2.5-builder/src/main/xsdconfig/xmlconfig.xml
xml Error/home/geronimo/geronimo/trunk/plugins/j2ee/geronimo-web-2.5-builder/src/main/xsd/geronimo-web-2.0.1.xsd:38:5:
error: java.net.ConnectException: Connection timed out
xml Error/home/geronimo/geronimo/trunk/plugins/j2ee/geronimo-web-2.5-builder/src/main/xsd/geronimo-web-2.0.1.xsd:121:17:
error: src-resolve: element 'persistence@http://java.sun.com/xml/ns/persistence' not found.

[INFO] ------------------------------------------------------------------------
[INFO] Trace
org.apache.maven.lifecycle.LifecycleExecutionException: XmlBeans compile failed:
 xml ErrorLoading schema file /home/geronimo/geronimo/trunk/plugins/j2ee/geronimo-web-2.5-builder/src/main/xsd/geronimo-web-2.0.1.xsd
xml ErrorLoading config file /home/geronimo/geronimo/trunk/plugins/j2ee/geronimo-web-2.5-builder/src/main/xsdconfig/xmlconfig.xml
xml Error/home/geronimo/geronimo/trunk/plugins/j2ee/geronimo-web-2.5-builder/src/main/xsd/geronimo-web-2.0.1.xsd:38:5:
error: java.net.ConnectException: Connection timed out
xml Error/home/geronimo/geronimo/trunk/plugins/j2ee/geronimo-web-2.5-builder/src/main/xsd/geronimo-web-2.0.1.xsd:121:17:
error: src-resolve: element 'persistence@http://java.sun.com/xml/ns/persistence' not found.

	at org.apache.maven.lifecycle.DefaultLifecycleExecutor.executeGoals(DefaultLifecycleExecutor.java:719)
	at org.apache.maven.lifecycle.DefaultLifecycleExecutor.executeGoalWithLifecycle(DefaultLifecycleExecutor.java:556)
	at org.apache.maven.lifecycle.DefaultLifecycleExecutor.executeGoal(DefaultLifecycleExecutor.java:535)
	at org.apache.maven.lifecycle.DefaultLifecycleExecutor.executeGoalAndHandleFailures(DefaultLifecycleExecutor.java:387)
	at org.apache.maven.lifecycle.DefaultLifecycleExecutor.executeTaskSegments(DefaultLifecycleExecutor.java:348)
	at org.apache.maven.lifecycle.DefaultLifecycleExecutor.execute(DefaultLifecycleExecutor.java:180)
	at org.apache.maven.DefaultMaven.doExecute(DefaultMaven.java:328)
	at org.apache.maven.DefaultMaven.execute(DefaultMaven.java:138)
	at org.apache.maven.cli.MavenCli.main(MavenCli.java:362)
	at org.apache.maven.cli.compat.CompatibleMain.main(CompatibleMain.java:60)
	at sun.reflect.NativeMethodAccessorImpl.invoke0(Native Method)
	at sun.reflect.NativeMethodAccessorImpl.invoke(NativeMethodAccessorImpl.java:39)
	at sun.reflect.DelegatingMethodAccessorImpl.invoke(DelegatingMethodAccessorImpl.java:25)
	at java.lang.reflect.Method.invoke(Method.java:597)
	at org.codehaus.classworlds.Launcher.launchEnhanced(Launcher.java:315)
	at org.codehaus.classworlds.Launcher.launch(Launcher.java:255)
	at org.codehaus.classworlds.Launcher.mainWithExitCode(Launcher.java:430)
	at org.codehaus.classworlds.Launcher.main(Launcher.java:375)
Caused by: org.codehaus.mojo.xmlbeans.XmlBeansException: XmlBeans compile failed:
 xml ErrorLoading schema file /home/geronimo/geronimo/trunk/plugins/j2ee/geronimo-web-2.5-builder/src/main/xsd/geronimo-web-2.0.1.xsd
xml ErrorLoading config file /home/geronimo/geronimo/trunk/plugins/j2ee/geronimo-web-2.5-builder/src/main/xsdconfig/xmlconfig.xml
xml Error/home/geronimo/geronimo/trunk/plugins/j2ee/geronimo-web-2.5-builder/src/main/xsd/geronimo-web-2.0.1.xsd:38:5:
error: java.net.ConnectException: Connection timed out
xml Error/home/geronimo/geronimo/trunk/plugins/j2ee/geronimo-web-2.5-builder/src/main/xsd/geronimo-web-2.0.1.xsd:121:17:
error: src-resolve: element 'persistence@http://java.sun.com/xml/ns/persistence' not found.

	at org.codehaus.mojo.xmlbeans.AbstractXmlBeansPlugin.execute(AbstractXmlBeansPlugin.java:292)
	at org.apache.maven.plugin.DefaultPluginManager.executeMojo(DefaultPluginManager.java:490)
	at org.apache.maven.lifecycle.DefaultLifecycleExecutor.executeGoals(DefaultLifecycleExecutor.java:694)
	... 17 more
[INFO] ------------------------------------------------------------------------
[INFO] Total time: 21 minutes 25 seconds
[INFO] Finished at: Mon Nov 01 09:22:42 EDT 2010
[INFO] Final Memory: 473M/999M
[INFO] ------------------------------------------------------------------------

Mime
View raw message