geronimo-dev mailing list archives

Site index · List index
Message view « Date » · « Thread »
Top « Date » · « Thread »
From Shawn Jiang <genspr...@gmail.com>
Subject Re: [BUILD] trunk: Failed for Revision: 1027790
Date Wed, 27 Oct 2010 05:04:22 GMT
3.0 failed to build because of openejb changes ?

On Wed, Oct 27, 2010 at 9:39 AM, <gawor@apache.org> wrote:

> Geronimo Revision: 1027790 built with tests included
>
> See the full build-2100.log file at
> http://people.apache.org/builds/geronimo/server/binaries/trunk/20101026/build-2100.log
>
>
> See the unit test reports at
> http://people.apache.org/builds/geronimo/server/binaries/trunk/20101026/unit-test-reports
>
> [INFO] Unable to find resource
> 'org.apache.geronimo.specs:geronimo-ejb_3.0_spec:jar:1.0.1' in repository
> JBoss Repository (
> https://repository.jboss.org/nexus/content/groups/public-jboss/)
> Downloading:
> http://svn.apache.org/repos/asf/openejb/repo//org/apache/geronimo/specs/geronimo-ejb_3.0_spec/1.0.1/geronimo-ejb_3.0_spec-1.0.1.jar
> Downloading:
> http://repository.apache.org/snapshots//org/apache/openwebbeans/openwebbeans-ee/1.1.0-SNAPSHOT/openwebbeans-ee-1.1.0-20101020.115827-1.jar
> [INFO] Unable to find resource
> 'org.codehaus.swizzle:swizzle-stream:jar:1.0.2' in repository
> openejb-3rdparty-builds (http://svn.apache.org/repos/asf/openejb/repo/)
> Downloading:
> http://maven.rtp.raleigh.ibm.com/nexus-proxy//org/codehaus/swizzle/swizzle-stream/1.0.2/swizzle-stream-1.0.2.jar
> [INFO] Unable to find resource
> 'org.apache.geronimo.specs:geronimo-ejb_3.0_spec:jar:1.0.1' in repository
> openejb-3rdparty-builds (http://svn.apache.org/repos/asf/openejb/repo/)
> Downloading:
> http://maven.rtp.raleigh.ibm.com/nexus-proxy//org/apache/geronimo/specs/geronimo-ejb_3.0_spec/1.0.1/geronimo-ejb_3.0_spec-1.0.1.jar
> 42K<http://maven.rtp.raleigh.ibm.com/nexus-proxy//org/apache/geronimo/specs/geronimo-ejb_3.0_spec/1.0.1/geronimo-ejb_3.0_spec-1.0.1.jar%0A42K>downloaded
 (swizzle-stream-1.0.2.jar)
> 17K downloaded  (openwebbeans-ee-1.1.0-20101020.115827-1.jar)
> [INFO] snapshot
> org.apache.geronimo.modules:geronimo-openwebbeans:3.0-SNAPSHOT: checking for
> updates from jetty.oss.sonatype.org
> 1826K downloaded  (openejb-core-3.2-20101022.020029-47.jar)
> [INFO] snapshot
> org.apache.geronimo.modules:geronimo-openwebbeans:3.0-SNAPSHOT: checking for
> updates from openqa-snapshots
> [INFO] snapshot
> org.apache.geronimo.modules:geronimo-openwebbeans:3.0-SNAPSHOT: checking for
> updates from codehaus.snapshots
> [INFO] snapshot
> org.apache.geronimo.modules:geronimo-openwebbeans:3.0-SNAPSHOT: checking for
> updates from apache.snapshots
> Downloading:
> http://repository.apache.org/snapshots//org/apache/openwebbeans/openwebbeans-ee-common/1.1.0-SNAPSHOT/openwebbeans-ee-common-1.1.0-20101020.115827-1.jar
> Downloading:
> http://repository.apache.org/snapshots//org/apache/openejb/openejb-api/3.2-SNAPSHOT/openejb-api-3.2-20101022.020029-53.jar
> 11K<http://repository.apache.org/snapshots//org/apache/openejb/openejb-api/3.2-SNAPSHOT/openejb-api-3.2-20101022.020029-53.jar%0A11K>downloaded
 (openwebbeans-ee-common-1.1.0-20101020.115827-1.jar)
> 31K downloaded  (geronimo-ejb_3.0_spec-1.0.1.jar)
> 8K downloaded  (openejb-api-3.2-20101022.020029-53.jar)
> Downloading:
> http://repository.apache.org/snapshots/org/apache/openejb/openejb-loader/3.2-SNAPSHOT/openejb-loader-3.2-20101022.020029-53.jar
> 43K<http://repository.apache.org/snapshots/org/apache/openejb/openejb-loader/3.2-SNAPSHOT/openejb-loader-3.2-20101022.020029-53.jar%0A43K>downloaded
 (openejb-loader-3.2-20101022.020029-53.jar)
> Downloading:
> http://repository.apache.org/snapshots/org/apache/openejb/openejb-javaagent/3.2-SNAPSHOT/openejb-javaagent-3.2-20101022.020029-53.jar
> 12K<http://repository.apache.org/snapshots/org/apache/openejb/openejb-javaagent/3.2-SNAPSHOT/openejb-javaagent-3.2-20101022.020029-53.jar%0A12K>downloaded
 (openejb-javaagent-3.2-20101022.020029-53.jar)
> Downloading:
> http://repository.apache.org/snapshots/org/apache/openejb/openejb-ejbd/3.2-SNAPSHOT/openejb-ejbd-3.2-20101022.020029-44.jar
> 59K<http://repository.apache.org/snapshots/org/apache/openejb/openejb-ejbd/3.2-SNAPSHOT/openejb-ejbd-3.2-20101022.020029-44.jar%0A59K>downloaded
 (openejb-ejbd-3.2-20101022.020029-44.jar)
> Downloading:
> http://repository.apache.org/snapshots/org/apache/openejb/openejb-server/3.2-SNAPSHOT/openejb-server-3.2-20101022.020029-46.jar
> 86K<http://repository.apache.org/snapshots/org/apache/openejb/openejb-server/3.2-SNAPSHOT/openejb-server-3.2-20101022.020029-46.jar%0A86K>downloaded
 (openejb-server-3.2-20101022.020029-46.jar)
> Downloading:
> http://repository.apache.org/snapshots/org/apache/openejb/openejb-client/3.2-SNAPSHOT/openejb-client-3.2-20101022.020029-46.jar
> 229K<http://repository.apache.org/snapshots/org/apache/openejb/openejb-client/3.2-SNAPSHOT/openejb-client-3.2-20101022.020029-46.jar%0A229K>downloaded
 (openejb-client-3.2-20101022.020029-46.jar)
> Downloading:
> http://repository.apache.org/snapshots/org/apache/openejb/openejb-multicast/3.2-SNAPSHOT/openejb-multicast-3.2-20101022.020029-46.jar
> 50K<http://repository.apache.org/snapshots/org/apache/openejb/openejb-multicast/3.2-SNAPSHOT/openejb-multicast-3.2-20101022.020029-46.jar%0A50K>downloaded
 (openejb-multicast-3.2-20101022.020029-46.jar)
> [INFO] [enforcer:enforce {execution: default}]
> [INFO] [remote-resources:process {execution: default}]
> [INFO] [resources:resources {execution: default-resources}]
> [INFO] Using 'UTF-8' encoding to copy filtered resources.
> [INFO] Copying 1 resource
> [INFO] skip non existing resourceDirectory
> /home/geronimo/geronimo/trunk/plugins/openejb/geronimo-openejb/src/main/filtered-resources
> [INFO] Copying 3 resources
> [INFO] [compiler:compile {execution: default-compile}]
> [INFO] Compiling 35 source files to
> /home/geronimo/geronimo/trunk/plugins/openejb/geronimo-openejb/target/classes
> [INFO]
> ------------------------------------------------------------------------
> [ERROR] BUILD FAILURE
> [INFO]
> ------------------------------------------------------------------------
> [INFO] Compilation failure
>
> /home/geronimo/geronimo/trunk/plugins/openejb/geronimo-openejb/src/main/java/org/apache/geronimo/openejb/ThreadSingletonServiceAdapter.java:[32,29]
> cannot find symbol
> symbol  : class OpenEJBLifecycle
> location: package org.apache.openejb.cdi
>
> /home/geronimo/geronimo/trunk/plugins/openejb/geronimo-openejb/src/main/java/org/apache/geronimo/openejb/ThreadSingletonServiceAdapter.java:[33,29]
> cannot find symbol
> symbol  : class StartupObject
> location: package org.apache.openejb.cdi
>
> /home/geronimo/geronimo/trunk/plugins/openejb/geronimo-openejb/src/main/java/org/apache/geronimo/openejb/ThreadSingletonServiceAdapter.java:[50,27]
> cannot find symbol
> symbol  : class StartupObject
> location: class org.apache.geronimo.openejb.ThreadSingletonServiceAdapter
>
> /home/geronimo/geronimo/trunk/plugins/openejb/geronimo-openejb/src/main/java/org/apache/geronimo/openejb/GeronimoSecurityService.java:[53,45]
> [deprecation]
> login(java.lang.String,javax.security.auth.callback.CallbackHandler) in
> org.apache.geronimo.security.ContextManager has been deprecated
>
> /home/geronimo/geronimo/trunk/plugins/openejb/geronimo-openejb/src/main/java/org/apache/geronimo/openejb/ThreadSingletonServiceAdapter.java:[68,29]
> cannot find symbol
> symbol  : constructor
> OWBContext(java.util.Map<java.lang.String,java.lang.Object>)
> location: class org.apache.openejb.cdi.OWBContext
>
> /home/geronimo/geronimo/trunk/plugins/openejb/geronimo-openejb/src/main/java/org/apache/geronimo/openejb/ThreadSingletonServiceAdapter.java:[81,81]
> cannot find symbol
> symbol  : class OpenEJBLifecycle
> location: class org.apache.geronimo.openejb.ThreadSingletonServiceAdapter
>
>
> [INFO]
> ------------------------------------------------------------------------
> [INFO] Trace
> org.apache.maven.BuildFailureException: Compilation failure
>        at
> org.apache.maven.lifecycle.DefaultLifecycleExecutor.executeGoals(DefaultLifecycleExecutor.java:715)
>        at
> org.apache.maven.lifecycle.DefaultLifecycleExecutor.executeGoalWithLifecycle(DefaultLifecycleExecutor.java:556)
>        at
> org.apache.maven.lifecycle.DefaultLifecycleExecutor.executeGoal(DefaultLifecycleExecutor.java:535)
>        at
> org.apache.maven.lifecycle.DefaultLifecycleExecutor.executeGoalAndHandleFailures(DefaultLifecycleExecutor.java:387)
>        at
> org.apache.maven.lifecycle.DefaultLifecycleExecutor.executeTaskSegments(DefaultLifecycleExecutor.java:348)
>        at
> org.apache.maven.lifecycle.DefaultLifecycleExecutor.execute(DefaultLifecycleExecutor.java:180)
>        at org.apache.maven.DefaultMaven.doExecute(DefaultMaven.java:328)
>        at org.apache.maven.DefaultMaven.execute(DefaultMaven.java:138)
>        at org.apache.maven.cli.MavenCli.main(MavenCli.java:362)
>        at
> org.apache.maven.cli.compat.CompatibleMain.main(CompatibleMain.java:60)
>        at sun.reflect.NativeMethodAccessorImpl.invoke0(Native Method)
>        at
> sun.reflect.NativeMethodAccessorImpl.invoke(NativeMethodAccessorImpl.java:39)
>        at
> sun.reflect.DelegatingMethodAccessorImpl.invoke(DelegatingMethodAccessorImpl.java:25)
>        at java.lang.reflect.Method.invoke(Method.java:597)
>        at
> org.codehaus.classworlds.Launcher.launchEnhanced(Launcher.java:315)
>        at org.codehaus.classworlds.Launcher.launch(Launcher.java:255)
>        at
> org.codehaus.classworlds.Launcher.mainWithExitCode(Launcher.java:430)
>        at org.codehaus.classworlds.Launcher.main(Launcher.java:375)
> Caused by: org.apache.maven.plugin.CompilationFailureException: Compilation
> failure
>        at
> org.apache.maven.plugin.AbstractCompilerMojo.execute(AbstractCompilerMojo.java:516)
>        at
> org.apache.maven.plugin.CompilerMojo.execute(CompilerMojo.java:114)
>        at
> org.apache.maven.plugin.DefaultPluginManager.executeMojo(DefaultPluginManager.java:490)
>        at
> org.apache.maven.lifecycle.DefaultLifecycleExecutor.executeGoals(DefaultLifecycleExecutor.java:694)
>        ... 17 more
> [INFO]
> ------------------------------------------------------------------------
> [INFO] Total time: 23 minutes 41 seconds
> [INFO] Finished at: Tue Oct 26 21:27:11 EDT 2010
> [INFO] Final Memory: 343M/807M
> [INFO]
> ------------------------------------------------------------------------
>



-- 
Shawn

Mime
View raw message