geronimo-dev mailing list archives

Site index · List index
Message view « Date » · « Thread »
Top « Date » · « Thread »
From ga...@apache.org
Subject [BUILD] branches/2.2: Failed for Revision: 1028549
Date Fri, 29 Oct 2010 12:14:49 GMT
Geronimo Revision: 1028549 built with tests included
 
See the full build-2000.log file at http://people.apache.org/builds/geronimo/server/binaries/2.2/20101029/build-2000.log
 
 
See the unit test reports at http://people.apache.org/builds/geronimo/server/binaries/2.2/20101029/unit-test-reports
 
[WARNING] Component returned which is not the same manager. Ignored. component=org.apache.maven.profiles.activation.JdkPrefixProfileActivator@507a507a
[WARNING] Component returned which is not the same manager. Ignored. component=org.apache.maven.profiles.activation.FileProfileActivator@507a507a
[WARNING] Component returned which is not the same manager. Ignored. component=org.apache.maven.profiles.activation.JdkPrefixProfileActivator@507a507a
[WARNING] Component returned which is not the same manager. Ignored. component=org.apache.maven.profiles.activation.FileProfileActivator@507a507a
[WARNING] Component returned which is not the same manager. Ignored. component=org.apache.maven.profiles.activation.JdkPrefixProfileActivator@507a507a
[WARNING] Component returned which is not the same manager. Ignored. component=org.apache.maven.profiles.activation.FileProfileActivator@507a507a
[WARNING] Component returned which is not the same manager. Ignored. component=org.apache.maven.profiles.activation.JdkPrefixProfileActivator@507a507a
[WARNING] Component returned which is not the same manager. Ignored. component=org.apache.maven.profiles.activation.FileProfileActivator@507a507a
[WARNING] Component returned which is not the same manager. Ignored. component=org.apache.maven.profiles.activation.JdkPrefixProfileActivator@507a507a
[WARNING] Component returned which is not the same manager. Ignored. component=org.apache.maven.profiles.activation.FileProfileActivator@507a507a
[WARNING] Component returned which is not the same manager. Ignored. component=org.apache.maven.profiles.activation.JdkPrefixProfileActivator@507a507a
[WARNING] Component returned which is not the same manager. Ignored. component=org.apache.maven.profiles.activation.FileProfileActivator@507a507a
[WARNING] Component returned which is not the same manager. Ignored. component=org.apache.maven.profiles.activation.JdkPrefixProfileActivator@507a507a
[WARNING] Component returned which is not the same manager. Ignored. component=org.apache.maven.profiles.activation.FileProfileActivator@507a507a
[WARNING] Component returned which is not the same manager. Ignored. component=org.apache.maven.profiles.activation.JdkPrefixProfileActivator@507a507a
[WARNING] Component returned which is not the same manager. Ignored. component=org.apache.maven.profiles.activation.FileProfileActivator@507a507a
[WARNING] Component returned which is not the same manager. Ignored. component=org.apache.maven.profiles.activation.JdkPrefixProfileActivator@507a507a
[WARNING] Component returned which is not the same manager. Ignored. component=org.apache.maven.profiles.activation.FileProfileActivator@507a507a
[WARNING] Component returned which is not the same manager. Ignored. component=org.apache.maven.profiles.activation.JdkPrefixProfileActivator@507a507a
[WARNING] Component returned which is not the same manager. Ignored. component=org.apache.maven.profiles.activation.FileProfileActivator@507a507a
[WARNING] Component returned which is not the same manager. Ignored. component=org.apache.maven.profiles.activation.JdkPrefixProfileActivator@507a507a
[WARNING] Component returned which is not the same manager. Ignored. component=org.apache.maven.profiles.activation.FileProfileActivator@507a507a
[WARNING] Component returned which is not the same manager. Ignored. component=org.apache.maven.profiles.activation.JdkPrefixProfileActivator@507a507a
[WARNING] Component returned which is not the same manager. Ignored. component=org.apache.maven.profiles.activation.FileProfileActivator@507a507a
[WARNING] Component returned which is not the same manager. Ignored. component=org.apache.maven.profiles.activation.JdkPrefixProfileActivator@507a507a
[WARNING] Component returned which is not the same manager. Ignored. component=org.apache.maven.profiles.activation.FileProfileActivator@507a507a
[WARNING] Component returned which is not the same manager. Ignored. component=org.apache.maven.profiles.activation.JdkPrefixProfileActivator@507a507a
[WARNING] Component returned which is not the same manager. Ignored. component=org.apache.maven.profiles.activation.FileProfileActivator@507a507a
[WARNING] Component returned which is not the same manager. Ignored. component=org.apache.maven.profiles.activation.JdkPrefixProfileActivator@507a507a
[WARNING] Component returned which is not the same manager. Ignored. component=org.apache.maven.profiles.activation.FileProfileActivator@507a507a
[WARNING] Component returned which is not the same manager. Ignored. component=org.apache.maven.profiles.activation.JdkPrefixProfileActivator@507a507a
[WARNING] Component returned which is not the same manager. Ignored. component=org.apache.maven.profiles.activation.FileProfileActivator@507a507a
[WARNING] Component returned which is not the same manager. Ignored. component=org.apache.maven.profiles.activation.JdkPrefixProfileActivator@507a507a
[WARNING] Component returned which is not the same manager. Ignored. component=org.apache.maven.profiles.activation.FileProfileActivator@507a507a
[WARNING] Component returned which is not the same manager. Ignored. component=org.apache.maven.profiles.activation.JdkPrefixProfileActivator@507a507a
[WARNING] Component returned which is not the same manager. Ignored. component=org.apache.maven.profiles.activation.FileProfileActivator@507a507a
[WARNING] Component returned which is not the same manager. Ignored. component=org.apache.maven.profiles.activation.JdkPrefixProfileActivator@507a507a
Downloading: http://maven.rtp.raleigh.ibm.com/nexus-proxy//org/apache/cxf/cxf-tools-java2ws/2.1.10/cxf-tools-java2ws-2.1.10.jar
111K downloaded  (cxf-tools-java2ws-2.1.10.jar)
Downloading: http://maven.rtp.raleigh.ibm.com/nexus-proxy//org/apache/cxf/cxf-tools-wsdlto-core/2.1.10/cxf-tools-wsdlto-core-2.1.10.jar
49K downloaded  (cxf-tools-wsdlto-core-2.1.10.jar)
Downloading: http://maven.rtp.raleigh.ibm.com/nexus-proxy//org/apache/cxf/cxf-tools-validator/2.1.10/cxf-tools-validator-2.1.10.jar
67K downloaded  (cxf-tools-validator-2.1.10.jar)
Downloading: http://maven.rtp.raleigh.ibm.com/nexus-proxy//org/apache/cxf/cxf-common-schemas/2.1.10/cxf-common-schemas-2.1.10.jar
46K downloaded  (cxf-common-schemas-2.1.10.jar)
Downloading: http://maven.rtp.raleigh.ibm.com/nexus-proxy//org/apache/cxf/cxf-tools-wsdlto-databinding-jaxb/2.1.10/cxf-tools-wsdlto-databinding-jaxb-2.1.10.jar
30K downloaded  (cxf-tools-wsdlto-databinding-jaxb-2.1.10.jar)
Downloading: http://maven.rtp.raleigh.ibm.com/nexus-proxy//org/apache/cxf/cxf-tools-wsdlto-frontend-jaxws/2.1.10/cxf-tools-wsdlto-frontend-jaxws-2.1.10.jar
146K downloaded  (cxf-tools-wsdlto-frontend-jaxws-2.1.10.jar)
[INFO] [enforcer:enforce {execution: default}]
[INFO] [remote-resources:process {execution: default}]
[INFO] [resources:resources {execution: default-resources}]
[INFO] Using 'UTF-8' encoding to copy filtered resources.
[INFO] skip non existing resourceDirectory /home/geronimo/geronimo/2.2/plugins/cxf/geronimo-cxf-tools/src/main/resources
[INFO] Copying 1 resource
[INFO] Copying 3 resources
[INFO] [compiler:compile {execution: default-compile}]
[INFO] Compiling 4 source files to /home/geronimo/geronimo/2.2/plugins/cxf/geronimo-cxf-tools/target/classes
[INFO] ------------------------------------------------------------------------
[ERROR] BUILD FAILURE
[INFO] ------------------------------------------------------------------------
[INFO] Compilation failure
error: error reading /home/geronimo/.m2/repository/com/sun/xml/bind/jaxb-xjc/2.1.7/jaxb-xjc-2.1.7.jar;
Error opening zip file /home/geronimo/.m2/repository/com/sun/xml/bind/jaxb-xjc/2.1.7/jaxb-xjc-2.1.7.jar

[INFO] ------------------------------------------------------------------------
[INFO] Trace
org.apache.maven.BuildFailureException: Compilation failure
error: error reading /home/geronimo/.m2/repository/com/sun/xml/bind/jaxb-xjc/2.1.7/jaxb-xjc-2.1.7.jar;
Error opening zip file /home/geronimo/.m2/repository/com/sun/xml/bind/jaxb-xjc/2.1.7/jaxb-xjc-2.1.7.jar

	at org.apache.maven.lifecycle.DefaultLifecycleExecutor.executeGoals(DefaultLifecycleExecutor.java:715)
	at org.apache.maven.lifecycle.DefaultLifecycleExecutor.executeGoalWithLifecycle(DefaultLifecycleExecutor.java:556)
	at org.apache.maven.lifecycle.DefaultLifecycleExecutor.executeGoal(DefaultLifecycleExecutor.java:535)
	at org.apache.maven.lifecycle.DefaultLifecycleExecutor.executeGoalAndHandleFailures(DefaultLifecycleExecutor.java:387)
	at org.apache.maven.lifecycle.DefaultLifecycleExecutor.executeTaskSegments(DefaultLifecycleExecutor.java:348)
	at org.apache.maven.lifecycle.DefaultLifecycleExecutor.execute(DefaultLifecycleExecutor.java:180)
	at org.apache.maven.DefaultMaven.doExecute(DefaultMaven.java:328)
	at org.apache.maven.DefaultMaven.execute(DefaultMaven.java:138)
	at org.apache.maven.cli.MavenCli.main(MavenCli.java:362)
	at org.apache.maven.cli.compat.CompatibleMain.main(CompatibleMain.java:60)
	at sun.reflect.NativeMethodAccessorImpl.invoke0(Native Method)
	at sun.reflect.NativeMethodAccessorImpl.invoke(NativeMethodAccessorImpl.java:79)
	at sun.reflect.DelegatingMethodAccessorImpl.invoke(DelegatingMethodAccessorImpl.java:43)
	at java.lang.reflect.Method.invoke(Method.java:618)
	at org.codehaus.classworlds.Launcher.launchEnhanced(Launcher.java:315)
	at org.codehaus.classworlds.Launcher.launch(Launcher.java:255)
	at org.codehaus.classworlds.Launcher.mainWithExitCode(Launcher.java:430)
	at org.codehaus.classworlds.Launcher.main(Launcher.java:375)
Caused by: org.apache.maven.plugin.CompilationFailureException: Compilation failure
error: error reading /home/geronimo/.m2/repository/com/sun/xml/bind/jaxb-xjc/2.1.7/jaxb-xjc-2.1.7.jar;
Error opening zip file /home/geronimo/.m2/repository/com/sun/xml/bind/jaxb-xjc/2.1.7/jaxb-xjc-2.1.7.jar

	at org.apache.maven.plugin.AbstractCompilerMojo.execute(AbstractCompilerMojo.java:516)
	at org.apache.maven.plugin.CompilerMojo.execute(CompilerMojo.java:114)
	at org.apache.maven.plugin.DefaultPluginManager.executeMojo(DefaultPluginManager.java:490)
	at org.apache.maven.lifecycle.DefaultLifecycleExecutor.executeGoals(DefaultLifecycleExecutor.java:694)
	... 17 more
[INFO] ------------------------------------------------------------------------
[INFO] Total time: 744 minutes 45 seconds
[INFO] Finished at: Fri Oct 29 08:30:41 EDT 2010
[INFO] Final Memory: 264M/699M
[INFO] ------------------------------------------------------------------------

Mime
View raw message