geronimo-dev mailing list archives

Site index · List index
Message view « Date » · « Thread »
Top « Date » · « Thread »
From ga...@apache.org
Subject [BUILD] branches/2.2: Failed for Revision: 1028265
Date Thu, 28 Oct 2010 21:07:08 GMT
Geronimo Revision: 1028265 built with tests included
 
See the full build-0800.log file at http://people.apache.org/builds/geronimo/server/binaries/2.2/20101028/build-0800.log
 
Download the binaries from http://people.apache.org/builds/geronimo/server/binaries/2.2/20101028
[INFO] BUILD SUCCESSFUL
[INFO] ------------------------------------------------------------------------
[INFO] Total time: 396 minutes 12 seconds
[INFO] Finished at: Thu Oct 28 14:42:35 EDT 2010
[INFO] Final Memory: 345M/858M
[INFO] ------------------------------------------------------------------------
 
TESTSUITE RESULTS (Failures only)
=================================
 
Assembly: tomcat
=================================
See full test results and logs at http://people.apache.org/builds/geronimo/server/binaries/2.2/20101028/logs-0800-tomcat/
 
[INFO] Running TestSuite
[INFO] Tests run: 40, Failures: 17, Errors: 0, Skipped: 0, Time elapsed: 235.531 sec <<<
FAILURE!
[INFO] Running TestSuite
[INFO] Tests run: 12, Failures: 7, Errors: 0, Skipped: 0, Time elapsed: 73.595 sec <<<
FAILURE!
--
[INFO] Running TestSuite
[INFO] Tests run: 36, Failures: 1, Errors: 0, Skipped: 0, Time elapsed: 69.517 sec <<<
FAILURE!
 
Assembly: jetty
=================================
See full test results and logs at http://people.apache.org/builds/geronimo/server/binaries/2.2/20101028/logs-0800-jetty/
 
[INFO] Running TestSuite
[INFO] Tests run: 116, Failures: 3, Errors: 0, Skipped: 113, Time elapsed: 15.763 sec <<<
FAILURE!
[INFO] Running TestSuite
[INFO] Tests run: 12, Failures: 10, Errors: 0, Skipped: 0, Time elapsed: 76.746 sec <<<
FAILURE!
--
[INFO] Running TestSuite
[INFO] Tests run: 2, Failures: 2, Errors: 0, Skipped: 0, Time elapsed: 7.924 sec <<<
FAILURE!
--
[INFO] Running TestSuite
[INFO] Tests run: 36, Failures: 1, Errors: 0, Skipped: 0, Time elapsed: 17.812 sec <<<
FAILURE!
 
Samples: branches/2.2
=================================
Log: http://people.apache.org/builds/geronimo/server/binaries/2.2/20101028/samples-0800.log
 
Build status: FAILED
 

Mime
View raw message