geronimo-dev mailing list archives

Site index · List index
Message view « Date » · « Thread »
Top « Date » · « Thread »
From ga...@apache.org
Subject [BUILD] trunk: Failed for Revision: 1026188
Date Fri, 22 Oct 2010 01:36:13 GMT
Geronimo Revision: 1026188 built with tests included
 
See the full build-2100.log file at http://people.apache.org/builds/geronimo/server/binaries/trunk/20101021/build-2100.log
 
 
See the unit test reports at http://people.apache.org/builds/geronimo/server/binaries/trunk/20101021/unit-test-reports
 
43K downloaded  (openejb-loader-3.2-20101020.131205-52.jar)
Downloading: http://repository.apache.org/snapshots/org/apache/openejb/openejb-javaagent/3.2-SNAPSHOT/openejb-javaagent-3.2-20101020.131205-52.jar
12K downloaded  (openejb-javaagent-3.2-20101020.131205-52.jar)
Downloading: http://repository.apache.org/snapshots/org/apache/openejb/openejb-ejbd/3.2-SNAPSHOT/openejb-ejbd-3.2-20101020.131205-43.jar
59K downloaded  (openejb-ejbd-3.2-20101020.131205-43.jar)
Downloading: http://repository.apache.org/snapshots/org/apache/openejb/openejb-server/3.2-SNAPSHOT/openejb-server-3.2-20101020.131205-45.jar
86K downloaded  (openejb-server-3.2-20101020.131205-45.jar)
Downloading: http://repository.apache.org/snapshots/org/apache/openejb/openejb-client/3.2-SNAPSHOT/openejb-client-3.2-20101020.131205-45.jar
229K downloaded  (openejb-client-3.2-20101020.131205-45.jar)
Downloading: http://repository.apache.org/snapshots/org/apache/openejb/openejb-multicast/3.2-SNAPSHOT/openejb-multicast-3.2-20101020.131205-45.jar
50K downloaded  (openejb-multicast-3.2-20101020.131205-45.jar)
[INFO] [enforcer:enforce {execution: default}]
[INFO] [remote-resources:process {execution: default}]
[INFO] [resources:resources {execution: default-resources}]
[INFO] Using 'UTF-8' encoding to copy filtered resources.
[INFO] Copying 1 resource
[INFO] skip non existing resourceDirectory /home/geronimo/geronimo/trunk/plugins/openejb/geronimo-openejb/src/main/filtered-resources
[INFO] Copying 3 resources
[INFO] [compiler:compile {execution: default-compile}]
[INFO] Compiling 35 source files to /home/geronimo/geronimo/trunk/plugins/openejb/geronimo-openejb/target/classes
[INFO] ------------------------------------------------------------------------
[ERROR] BUILD FAILURE
[INFO] ------------------------------------------------------------------------
[INFO] Compilation failure

/home/geronimo/geronimo/trunk/plugins/openejb/geronimo-openejb/src/main/java/org/apache/geronimo/openejb/OpenEjbSystemGBean.java:[65,29]
cannot find symbol
symbol  : class OWBContextThreadListener
location: package org.apache.openejb.cdi

/home/geronimo/geronimo/trunk/plugins/openejb/geronimo-openejb/src/main/java/org/apache/geronimo/openejb/OpenEjbSystemGBean.java:[66,29]
cannot find symbol
symbol  : class ThreadSingletonService
location: package org.apache.openejb.cdi

/home/geronimo/geronimo/trunk/plugins/openejb/geronimo-openejb/src/main/java/org/apache/geronimo/openejb/ThreadSingletonServiceAdapter.java:[30,29]
cannot find symbol
symbol  : class ThreadSingletonService
location: package org.apache.openejb.cdi

/home/geronimo/geronimo/trunk/plugins/openejb/geronimo-openejb/src/main/java/org/apache/geronimo/openejb/ThreadSingletonServiceAdapter.java:[38,87]
cannot find symbol
symbol: class ThreadSingletonService
public class ThreadSingletonServiceAdapter extends GeronimoSingletonService implements ThreadSingletonService
{

/home/geronimo/geronimo/trunk/plugins/openejb/geronimo-openejb/src/main/java/org/apache/geronimo/openejb/ThreadSingletonServiceAdapter.java:[44,49]
cannot find symbol
symbol  : class OWBContext
location: package org.apache.openejb.cdi

/home/geronimo/geronimo/trunk/plugins/openejb/geronimo-openejb/src/main/java/org/apache/geronimo/openejb/ThreadSingletonServiceAdapter.java:[65,55]
cannot find symbol
symbol  : class OWBContext
location: package org.apache.openejb.cdi

/home/geronimo/geronimo/trunk/plugins/openejb/geronimo-openejb/src/main/java/org/apache/geronimo/openejb/GeronimoSecurityService.java:[53,45]
[deprecation] login(java.lang.String,javax.security.auth.callback.CallbackHandler) in org.apache.geronimo.security.ContextManager
has been deprecated

/home/geronimo/geronimo/trunk/plugins/openejb/geronimo-openejb/src/main/java/org/apache/geronimo/openejb/OpenEjbSystemGBean.java:[169,42]
cannot find symbol
symbol  : class ThreadSingletonService
location: class org.apache.geronimo.openejb.OpenEjbSystemGBean

/home/geronimo/geronimo/trunk/plugins/openejb/geronimo-openejb/src/main/java/org/apache/geronimo/openejb/OpenEjbSystemGBean.java:[171,51]
cannot find symbol
symbol  : class OWBContextThreadListener
location: class org.apache.geronimo.openejb.OpenEjbSystemGBean

/home/geronimo/geronimo/trunk/plugins/openejb/geronimo-openejb/src/main/java/org/apache/geronimo/openejb/ThreadSingletonServiceAdapter.java:[43,4]
method does not override or implement a method from a supertype

/home/geronimo/geronimo/trunk/plugins/openejb/geronimo-openejb/src/main/java/org/apache/geronimo/openejb/ThreadSingletonServiceAdapter.java:[65,18]
contextEntered(org.apache.openejb.cdi.OWBContext) in org.apache.geronimo.openejb.ThreadSingletonServiceAdapter
cannot override contextEntered(java.util.Map<java.lang.String,java.lang.Object>) in
org.apache.geronimo.openwebbeans.GeronimoSingletonService; overridden method is static

/home/geronimo/geronimo/trunk/plugins/openejb/geronimo-openejb/src/main/java/org/apache/geronimo/openejb/ThreadSingletonServiceAdapter.java:[64,4]
method does not override or implement a method from a supertype

/home/geronimo/geronimo/trunk/plugins/openejb/geronimo-openejb/src/main/java/org/apache/geronimo/openejb/ThreadSingletonServiceAdapter.java:[69,4]
method does not override or implement a method from a supertype


[INFO] ------------------------------------------------------------------------
[INFO] Trace
org.apache.maven.BuildFailureException: Compilation failure
	at org.apache.maven.lifecycle.DefaultLifecycleExecutor.executeGoals(DefaultLifecycleExecutor.java:715)
	at org.apache.maven.lifecycle.DefaultLifecycleExecutor.executeGoalWithLifecycle(DefaultLifecycleExecutor.java:556)
	at org.apache.maven.lifecycle.DefaultLifecycleExecutor.executeGoal(DefaultLifecycleExecutor.java:535)
	at org.apache.maven.lifecycle.DefaultLifecycleExecutor.executeGoalAndHandleFailures(DefaultLifecycleExecutor.java:387)
	at org.apache.maven.lifecycle.DefaultLifecycleExecutor.executeTaskSegments(DefaultLifecycleExecutor.java:348)
	at org.apache.maven.lifecycle.DefaultLifecycleExecutor.execute(DefaultLifecycleExecutor.java:180)
	at org.apache.maven.DefaultMaven.doExecute(DefaultMaven.java:328)
	at org.apache.maven.DefaultMaven.execute(DefaultMaven.java:138)
	at org.apache.maven.cli.MavenCli.main(MavenCli.java:362)
	at org.apache.maven.cli.compat.CompatibleMain.main(CompatibleMain.java:60)
	at sun.reflect.NativeMethodAccessorImpl.invoke0(Native Method)
	at sun.reflect.NativeMethodAccessorImpl.invoke(NativeMethodAccessorImpl.java:39)
	at sun.reflect.DelegatingMethodAccessorImpl.invoke(DelegatingMethodAccessorImpl.java:25)
	at java.lang.reflect.Method.invoke(Method.java:597)
	at org.codehaus.classworlds.Launcher.launchEnhanced(Launcher.java:315)
	at org.codehaus.classworlds.Launcher.launch(Launcher.java:255)
	at org.codehaus.classworlds.Launcher.mainWithExitCode(Launcher.java:430)
	at org.codehaus.classworlds.Launcher.main(Launcher.java:375)
Caused by: org.apache.maven.plugin.CompilationFailureException: Compilation failure
	at org.apache.maven.plugin.AbstractCompilerMojo.execute(AbstractCompilerMojo.java:516)
	at org.apache.maven.plugin.CompilerMojo.execute(CompilerMojo.java:114)
	at org.apache.maven.plugin.DefaultPluginManager.executeMojo(DefaultPluginManager.java:490)
	at org.apache.maven.lifecycle.DefaultLifecycleExecutor.executeGoals(DefaultLifecycleExecutor.java:694)
	... 17 more
[INFO] ------------------------------------------------------------------------
[INFO] Total time: 18 minutes 13 seconds
[INFO] Finished at: Thu Oct 21 21:24:09 EDT 2010
[INFO] Final Memory: 344M/813M
[INFO] ------------------------------------------------------------------------

Mime
View raw message