geronimo-dev mailing list archives

Site index · List index
Message view « Date » · « Thread »
Top « Date » · « Thread »
From ga...@apache.org
Subject [BUILD] trunk: Failed for Revision: 1024361
Date Tue, 19 Oct 2010 19:34:48 GMT
Geronimo Revision: 1024361 built with tests included
 
See the full build-1500.log file at http://people.apache.org/builds/geronimo/server/binaries/trunk/20101019/build-1500.log
 
 
See the unit test reports at http://people.apache.org/builds/geronimo/server/binaries/trunk/20101019/unit-test-reports
 
Downloading: file:///home/geronimo/.m2/jtidy.repository/commons-pool/commons-pool/1.5.4/commons-pool-1.5.4.jar
[INFO] Unable to find resource 'commons-pool:commons-pool:jar:1.5.4' in repository local (file:///home/geronimo/.m2/jtidy.repository)
Downloading: http://oss.sonatype.org/content/repositories/jetty//commons-pool/commons-pool/1.5.4/commons-pool-1.5.4.jar
Downloading: file:///home/geronimo/.m2/jtidy.repository/org/apache/servicemix/bundles/org.apache.servicemix.bundles.serp/1.13.1_2/org.apache.servicemix.bundles.serp-1.13.1_2.jar
[INFO] Unable to find resource 'org.apache.servicemix.bundles:org.apache.servicemix.bundles.serp:jar:1.13.1_2'
in repository local (file:///home/geronimo/.m2/jtidy.repository)
Downloading: http://oss.sonatype.org/content/repositories/jetty//org/apache/servicemix/bundles/org.apache.servicemix.bundles.serp/1.13.1_2/org.apache.servicemix.bundles.serp-1.13.1_2.jar
[INFO] Unable to find resource 'commons-pool:commons-pool:jar:1.5.4' in repository jetty.oss.sonatype.org
(http://oss.sonatype.org/content/repositories/jetty/)
[INFO] Unable to find resource 'org.apache.openjpa:openjpa:jar:2.0.1' in repository jetty.oss.sonatype.org
(http://oss.sonatype.org/content/repositories/jetty/)
Downloading: http://svn.apache.org/repos/asf/servicemix/m2-repo//commons-pool/commons-pool/1.5.4/commons-pool-1.5.4.jar
Downloading: http://svn.apache.org/repos/asf/servicemix/m2-repo//org/apache/openjpa/openjpa/2.0.1/openjpa-2.0.1.jar
[INFO] Unable to find resource 'org.apache.servicemix.bundles:org.apache.servicemix.bundles.serp:jar:1.13.1_2'
in repository jetty.oss.sonatype.org (http://oss.sonatype.org/content/repositories/jetty/)
Downloading: http://svn.apache.org/repos/asf/servicemix/m2-repo//org/apache/servicemix/bundles/org.apache.servicemix.bundles.serp/1.13.1_2/org.apache.servicemix.bundles.serp-1.13.1_2.jar
[INFO] Unable to find resource 'commons-pool:commons-pool:jar:1.5.4' in repository smx.svn
(http://svn.apache.org/repos/asf/servicemix/m2-repo/)
Downloading: http://download.java.net/maven/1//commons-pool/jars/commons-pool-1.5.4.jar
[INFO] Unable to find resource 'org.apache.openjpa:openjpa:jar:2.0.1' in repository smx.svn
(http://svn.apache.org/repos/asf/servicemix/m2-repo/)
Downloading: http://download.java.net/maven/1//org.apache.openjpa/jars/openjpa-2.0.1.jar
[INFO] Unable to find resource 'org.apache.servicemix.bundles:org.apache.servicemix.bundles.serp:jar:1.13.1_2'
in repository smx.svn (http://svn.apache.org/repos/asf/servicemix/m2-repo/)
Downloading: http://download.java.net/maven/1//org.apache.servicemix.bundles/jars/org.apache.servicemix.bundles.serp-1.13.1_2.jar
[INFO] Unable to find resource 'org.apache.openjpa:openjpa:jar:2.0.1' in repository java.net
(http://download.java.net/maven/1/)
Downloading: http://nexus.openqa.org/content/repositories/releases/org/apache/openjpa/openjpa/2.0.1/openjpa-2.0.1.jar
[INFO] Unable to find resource 'commons-pool:commons-pool:jar:1.5.4' in repository java.net
(http://download.java.net/maven/1/)
Downloading: http://nexus.openqa.org/content/repositories/releases/commons-pool/commons-pool/1.5.4/commons-pool-1.5.4.jar
[INFO] Unable to find resource 'org.apache.servicemix.bundles:org.apache.servicemix.bundles.serp:jar:1.13.1_2'
in repository java.net (http://download.java.net/maven/1/)
Downloading: http://nexus.openqa.org/content/repositories/releases/org/apache/servicemix/bundles/org.apache.servicemix.bundles.serp/1.13.1_2/org.apache.servicemix.bundles.serp-1.13.1_2.jar
[INFO] Unable to find resource 'org.apache.openjpa:openjpa:jar:2.0.1' in repository openqa-releases
(http://nexus.openqa.org/content/repositories/releases)
[INFO] Unable to find resource 'commons-pool:commons-pool:jar:1.5.4' in repository openqa-releases
(http://nexus.openqa.org/content/repositories/releases)
Downloading: http://maven.rtp.raleigh.ibm.com/nexus-proxy//org/apache/openjpa/openjpa/2.0.1/openjpa-2.0.1.jar
[INFO] Unable to find resource 'org.apache.servicemix.bundles:org.apache.servicemix.bundles.serp:jar:1.13.1_2'
in repository openqa-releases (http://nexus.openqa.org/content/repositories/releases)
Downloading: http://maven.rtp.raleigh.ibm.com/nexus-proxy//commons-pool/commons-pool/1.5.4/commons-pool-1.5.4.jar
Downloading: http://maven.rtp.raleigh.ibm.com/nexus-proxy//org/apache/servicemix/bundles/org.apache.servicemix.bundles.serp/1.13.1_2/org.apache.servicemix.bundles.serp-1.13.1_2.jar
93K downloaded  (commons-pool-1.5.4.jar)
207K downloaded  (org.apache.servicemix.bundles.serp-1.13.1_2.jar)
3980K downloaded  (openjpa-2.0.1.jar)
[INFO] [enforcer:enforce {execution: default}]
[INFO] [remote-resources:process {execution: default}]
[INFO] [resources:resources {execution: default-resources}]
[INFO] Using 'UTF-8' encoding to copy filtered resources.
[INFO] skip non existing resourceDirectory /home/geronimo/geronimo/trunk/plugins/openjpa2/geronimo-persistence-jpa20/src/main/resources
[INFO] skip non existing resourceDirectory /home/geronimo/geronimo/trunk/plugins/openjpa2/geronimo-persistence-jpa20/src/main/filtered-resources
[INFO] Copying 3 resources
[INFO] [compiler:compile {execution: default-compile}]
[INFO] Compiling 11 source files to /home/geronimo/geronimo/trunk/plugins/openjpa2/geronimo-persistence-jpa20/target/classes
[INFO] [resources:testResources {execution: default-testResources}]
[INFO] Using 'UTF-8' encoding to copy filtered resources.
[INFO] skip non existing resourceDirectory /home/geronimo/geronimo/trunk/plugins/openjpa2/geronimo-persistence-jpa20/src/test/resources
[INFO] skip non existing resourceDirectory /home/geronimo/geronimo/trunk/plugins/openjpa2/geronimo-persistence-jpa20/src/test/filtered-resources
[INFO] Copying 3 resources
[INFO] [compiler:testCompile {execution: default-testCompile}]
[INFO] Compiling 4 source files to /home/geronimo/geronimo/trunk/plugins/openjpa2/geronimo-persistence-jpa20/target/test-classes
[INFO] ------------------------------------------------------------------------
[ERROR] BUILD FAILURE
[INFO] ------------------------------------------------------------------------
[INFO] Compilation failure
/home/geronimo/geronimo/trunk/plugins/openjpa2/geronimo-persistence-jpa20/src/test/java/org/apache/geronimo/persistence/PersistenceUnitGBeanTest.java:[61,16]
cannot find symbol
symbol  : constructor ValidatorFactoryGBean(java.lang.String,org.apache.geronimo.kernel.osgi.MockBundle,java.lang.ClassLoader,<nulltype>)
location: class org.apache.geronimo.bval.ValidatorFactoryGBean


[INFO] ------------------------------------------------------------------------
[INFO] Trace
org.apache.maven.BuildFailureException: Compilation failure
/home/geronimo/geronimo/trunk/plugins/openjpa2/geronimo-persistence-jpa20/src/test/java/org/apache/geronimo/persistence/PersistenceUnitGBeanTest.java:[61,16]
cannot find symbol
symbol  : constructor ValidatorFactoryGBean(java.lang.String,org.apache.geronimo.kernel.osgi.MockBundle,java.lang.ClassLoader,<nulltype>)
location: class org.apache.geronimo.bval.ValidatorFactoryGBean


	at org.apache.maven.lifecycle.DefaultLifecycleExecutor.executeGoals(DefaultLifecycleExecutor.java:715)
	at org.apache.maven.lifecycle.DefaultLifecycleExecutor.executeGoalWithLifecycle(DefaultLifecycleExecutor.java:556)
	at org.apache.maven.lifecycle.DefaultLifecycleExecutor.executeGoal(DefaultLifecycleExecutor.java:535)
	at org.apache.maven.lifecycle.DefaultLifecycleExecutor.executeGoalAndHandleFailures(DefaultLifecycleExecutor.java:387)
	at org.apache.maven.lifecycle.DefaultLifecycleExecutor.executeTaskSegments(DefaultLifecycleExecutor.java:348)
	at org.apache.maven.lifecycle.DefaultLifecycleExecutor.execute(DefaultLifecycleExecutor.java:180)
	at org.apache.maven.DefaultMaven.doExecute(DefaultMaven.java:328)
	at org.apache.maven.DefaultMaven.execute(DefaultMaven.java:138)
	at org.apache.maven.cli.MavenCli.main(MavenCli.java:362)
	at org.apache.maven.cli.compat.CompatibleMain.main(CompatibleMain.java:60)
	at sun.reflect.NativeMethodAccessorImpl.invoke0(Native Method)
	at sun.reflect.NativeMethodAccessorImpl.invoke(NativeMethodAccessorImpl.java:39)
	at sun.reflect.DelegatingMethodAccessorImpl.invoke(DelegatingMethodAccessorImpl.java:25)
	at java.lang.reflect.Method.invoke(Method.java:597)
	at org.codehaus.classworlds.Launcher.launchEnhanced(Launcher.java:315)
	at org.codehaus.classworlds.Launcher.launch(Launcher.java:255)
	at org.codehaus.classworlds.Launcher.mainWithExitCode(Launcher.java:430)
	at org.codehaus.classworlds.Launcher.main(Launcher.java:375)
Caused by: org.apache.maven.plugin.CompilationFailureException: Compilation failure
/home/geronimo/geronimo/trunk/plugins/openjpa2/geronimo-persistence-jpa20/src/test/java/org/apache/geronimo/persistence/PersistenceUnitGBeanTest.java:[61,16]
cannot find symbol
symbol  : constructor ValidatorFactoryGBean(java.lang.String,org.apache.geronimo.kernel.osgi.MockBundle,java.lang.ClassLoader,<nulltype>)
location: class org.apache.geronimo.bval.ValidatorFactoryGBean


	at org.apache.maven.plugin.AbstractCompilerMojo.execute(AbstractCompilerMojo.java:516)
	at org.apache.maven.plugin.TestCompilerMojo.execute(TestCompilerMojo.java:102)
	at org.apache.maven.plugin.DefaultPluginManager.executeMojo(DefaultPluginManager.java:490)
	at org.apache.maven.lifecycle.DefaultLifecycleExecutor.executeGoals(DefaultLifecycleExecutor.java:694)
	... 17 more
[INFO] ------------------------------------------------------------------------
[INFO] Total time: 20 minutes 8 seconds
[INFO] Finished at: Tue Oct 19 15:22:50 EDT 2010
[INFO] Final Memory: 320M/816M
[INFO] ------------------------------------------------------------------------

Mime
View raw message