geronimo-dev mailing list archives

Site index · List index
Message view « Date » · « Thread »
Top « Date » · « Thread »
From ga...@apache.org
Subject [BUILD] trunk: Failed for Revision: 1021969
Date Wed, 13 Oct 2010 03:35:59 GMT
Geronimo Revision: 1021969 built with tests included
 
See the full build-2100.log file at http://people.apache.org/builds/geronimo/server/binaries/trunk/20101012/build-2100.log
 
Download the binaries from http://people.apache.org/builds/geronimo/server/binaries/trunk/20101012
[INFO] BUILD SUCCESSFUL
[INFO] ------------------------------------------------------------------------
[INFO] Total time: 37 minutes 23 seconds
[INFO] Finished at: Tue Oct 12 21:43:30 EDT 2010
[INFO] Final Memory: 460M/1007M
[INFO] ------------------------------------------------------------------------
 
TESTSUITE RESULTS (Failures only)
=================================
 
Assembly: tomcat
=================================
See full test results and logs at http://people.apache.org/builds/geronimo/server/binaries/trunk/20101012/logs-2100-tomcat/
 
Running TestSuite
Tests run: 9, Failures: 7, Errors: 0, Skipped: 0, Time elapsed: 21.63 sec <<< FAILURE!
--
Running TestSuite
Tests run: 1, Failures: 1, Errors: 0, Skipped: 0, Time elapsed: 19.887 sec <<< FAILURE!
 
[INFO] skip non existing resourceDirectory /home/geronimo/geronimo/trunk/testsuite/javaee6-testsuite/servlet3.0-test/fragment2/src/main/filtered-resources
[INFO] Copying 3 resources
[INFO] [compiler:compile {execution: default-compile}]
[INFO] Compiling 3 source files to /home/geronimo/geronimo/trunk/testsuite/javaee6-testsuite/servlet3.0-test/fragment2/target/classes
[INFO] [resources:testResources {execution: default-testResources}]
[INFO] Using 'UTF-8' encoding to copy filtered resources.
[INFO] skip non existing resourceDirectory /home/geronimo/geronimo/trunk/testsuite/javaee6-testsuite/servlet3.0-test/fragment2/src/test/resources
[INFO] skip non existing resourceDirectory /home/geronimo/geronimo/trunk/testsuite/javaee6-testsuite/servlet3.0-test/fragment2/src/test/filtered-resources
[INFO] Copying 3 resources
[INFO] [compiler:testCompile {execution: default-testCompile}]
[INFO] No sources to compile
[INFO] [surefire:test {execution: default-test}]
[INFO] Tests are skipped.
[INFO] [jar:jar {execution: default-jar}]
[INFO] Building jar: /home/geronimo/geronimo/trunk/testsuite/javaee6-testsuite/servlet3.0-test/fragment2/target/fragment2-3.0-SNAPSHOT.jar
[INFO] [ianal:verify-legal-files {execution: default}]
[WARNING] Skipping verification of legal files in artifacts:
[WARNING]     org.apache.geronimo.testsuite:fragment2:jar:3.0-SNAPSHOT
[INFO] [install:install {execution: default-install}]
[INFO] Installing /home/geronimo/geronimo/trunk/testsuite/javaee6-testsuite/servlet3.0-test/fragment2/target/fragment2-3.0-SNAPSHOT.jar
to /home/geronimo/.m2/repository/org/apache/geronimo/testsuite/fragment2/3.0-SNAPSHOT/fragment2-3.0-SNAPSHOT.jar
[INFO] ------------------------------------------------------------------------
[INFO] Building Geronimo TestSuite :: Java EE 6 Testsuite :: fragment3
[INFO]    task-segment: [install]
[INFO] ------------------------------------------------------------------------
[INFO] [genesis:validate-configuration {execution: default}]
[INFO] [geronimo-property:set-property {execution: set-property}]
[INFO] [enforcer:enforce {execution: default}]
[INFO] [remote-resources:process {execution: default}]
[INFO] [resources:resources {execution: default-resources}]
[INFO] Using 'UTF-8' encoding to copy filtered resources.
[INFO] Copying 1 resource
[INFO] skip non existing resourceDirectory /home/geronimo/geronimo/trunk/testsuite/javaee6-testsuite/servlet3.0-test/fragment3/src/main/filtered-resources
[INFO] Copying 3 resources
[INFO] [compiler:compile {execution: default-compile}]
[INFO] Compiling 3 source files to /home/geronimo/geronimo/trunk/testsuite/javaee6-testsuite/servlet3.0-test/fragment3/target/classes
[INFO] [resources:testResources {execution: default-testResources}]
[INFO] Using 'UTF-8' encoding to copy filtered resources.
[INFO] skip non existing resourceDirectory /home/geronimo/geronimo/trunk/testsuite/javaee6-testsuite/servlet3.0-test/fragment3/src/test/resources
[INFO] skip non existing resourceDirectory /home/geronimo/geronimo/trunk/testsuite/javaee6-testsuite/servlet3.0-test/fragment3/src/test/filtered-resources
[INFO] Copying 3 resources
[INFO] [compiler:testCompile {execution: default-testCompile}]
[INFO] No sources to compile
[INFO] [surefire:test {execution: default-test}]
[INFO] Tests are skipped.
[INFO] [jar:jar {execution: default-jar}]
[INFO] Building jar: /home/geronimo/geronimo/trunk/testsuite/javaee6-testsuite/servlet3.0-test/fragment3/target/fragment3-3.0-SNAPSHOT.jar
[INFO] [ianal:verify-legal-files {execution: default}]
[WARNING] Skipping verification of legal files in artifacts:
[WARNING]     org.apache.geronimo.testsuite:fragment3:jar:3.0-SNAPSHOT
[INFO] [install:install {execution: default-install}]
[INFO] Installing /home/geronimo/geronimo/trunk/testsuite/javaee6-testsuite/servlet3.0-test/fragment3/target/fragment3-3.0-SNAPSHOT.jar
to /home/geronimo/.m2/repository/org/apache/geronimo/testsuite/fragment3/3.0-SNAPSHOT/fragment3-3.0-SNAPSHOT.jar
[INFO] ------------------------------------------------------------------------
[INFO] Building Geronimo TestSuite :: Java EE 6 Testsuite :: servlet3.0-test-jar
[INFO]    task-segment: [install]
[INFO] ------------------------------------------------------------------------
[INFO] [genesis:validate-configuration {execution: default}]
[INFO] [geronimo-property:set-property {execution: set-property}]
[INFO] [enforcer:enforce {execution: default}]
[INFO] [remote-resources:process {execution: default}]
[INFO] [resources:resources {execution: default-resources}]
[INFO] Using 'UTF-8' encoding to copy filtered resources.
[INFO] Copying 1 resource
[INFO] skip non existing resourceDirectory /home/geronimo/geronimo/trunk/testsuite/javaee6-testsuite/servlet3.0-test/servlet3.0-test-jar/src/main/filtered-resources
[INFO] Copying 3 resources
[INFO] [compiler:compile {execution: default-compile}]
[INFO] No sources to compile
[INFO] [resources:testResources {execution: default-testResources}]
[INFO] Using 'UTF-8' encoding to copy filtered resources.
[INFO] skip non existing resourceDirectory /home/geronimo/geronimo/trunk/testsuite/javaee6-testsuite/servlet3.0-test/servlet3.0-test-jar/src/test/resources
[INFO] skip non existing resourceDirectory /home/geronimo/geronimo/trunk/testsuite/javaee6-testsuite/servlet3.0-test/servlet3.0-test-jar/src/test/filtered-resources
[INFO] Copying 3 resources
[INFO] [compiler:testCompile {execution: default-testCompile}]
[INFO] No sources to compile
[INFO] [surefire:test {execution: default-test}]
[INFO] Tests are skipped.
[INFO] [jar:jar {execution: default-jar}]
[INFO] Building jar: /home/geronimo/geronimo/trunk/testsuite/javaee6-testsuite/servlet3.0-test/servlet3.0-test-jar/target/servlet3.0-test-jar-3.0-SNAPSHOT.jar
[INFO] [ianal:verify-legal-files {execution: default}]
[WARNING] Skipping verification of legal files in artifacts:
[WARNING]     org.apache.geronimo.testsuite:servlet3.0-test-jar:jar:3.0-SNAPSHOT
[INFO] [install:install {execution: default-install}]
[INFO] Installing /home/geronimo/geronimo/trunk/testsuite/javaee6-testsuite/servlet3.0-test/servlet3.0-test-jar/target/servlet3.0-test-jar-3.0-SNAPSHOT.jar
to /home/geronimo/.m2/repository/org/apache/geronimo/testsuite/servlet3.0-test-jar/3.0-SNAPSHOT/servlet3.0-test-jar-3.0-SNAPSHOT.jar
[INFO] ------------------------------------------------------------------------
[INFO] Building Geronimo TestSuite :: Java EE 6 Testsuite :: servlet3.0-test-war
[INFO]    task-segment: [install]
[INFO] ------------------------------------------------------------------------
[INFO] [genesis:validate-configuration {execution: default}]
[INFO] [geronimo-property:set-property {execution: set-property}]
[INFO] [enforcer:enforce {execution: default}]
[INFO] [remote-resources:process {execution: default}]
[INFO] [resources:resources {execution: default-resources}]
[INFO] Using 'UTF-8' encoding to copy filtered resources.
[INFO] Copying 1 resource
[INFO] skip non existing resourceDirectory /home/geronimo/geronimo/trunk/testsuite/javaee6-testsuite/servlet3.0-test/servlet3.0-test-war/src/main/filtered-resources
[INFO] Copying 3 resources
[INFO] [compiler:compile {execution: default-compile}]
[INFO] Compiling 15 source files to /home/geronimo/geronimo/trunk/testsuite/javaee6-testsuite/servlet3.0-test/servlet3.0-test-war/target/classes
[INFO] [selenium:xvfb {execution: xvfb}]
[INFO] Starting Xvfb...
[INFO] ------------------------------------------------------------------------
[ERROR] BUILD ERROR
 
Assembly: jetty
=================================
See full test results and logs at http://people.apache.org/builds/geronimo/server/binaries/trunk/20101012/logs-2100-jetty/
 
Running TestSuite
Tests run: 2, Failures: 1, Errors: 0, Skipped: 0, Time elapsed: 2.247 sec <<< FAILURE!
--
Running TestSuite
Tests run: 9, Failures: 7, Errors: 0, Skipped: 0, Time elapsed: 22.945 sec <<< FAILURE!
--
Running TestSuite
Tests run: 1, Failures: 1, Errors: 0, Skipped: 0, Time elapsed: 19.485 sec <<< FAILURE!
 
[INFO] skip non existing resourceDirectory /home/geronimo/geronimo/trunk/testsuite/javaee6-testsuite/servlet3.0-test/fragment2/src/main/filtered-resources
[INFO] Copying 3 resources
[INFO] [compiler:compile {execution: default-compile}]
[INFO] Compiling 3 source files to /home/geronimo/geronimo/trunk/testsuite/javaee6-testsuite/servlet3.0-test/fragment2/target/classes
[INFO] [resources:testResources {execution: default-testResources}]
[INFO] Using 'UTF-8' encoding to copy filtered resources.
[INFO] skip non existing resourceDirectory /home/geronimo/geronimo/trunk/testsuite/javaee6-testsuite/servlet3.0-test/fragment2/src/test/resources
[INFO] skip non existing resourceDirectory /home/geronimo/geronimo/trunk/testsuite/javaee6-testsuite/servlet3.0-test/fragment2/src/test/filtered-resources
[INFO] Copying 3 resources
[INFO] [compiler:testCompile {execution: default-testCompile}]
[INFO] No sources to compile
[INFO] [surefire:test {execution: default-test}]
[INFO] Tests are skipped.
[INFO] [jar:jar {execution: default-jar}]
[INFO] Building jar: /home/geronimo/geronimo/trunk/testsuite/javaee6-testsuite/servlet3.0-test/fragment2/target/fragment2-3.0-SNAPSHOT.jar
[INFO] [ianal:verify-legal-files {execution: default}]
[WARNING] Skipping verification of legal files in artifacts:
[WARNING]     org.apache.geronimo.testsuite:fragment2:jar:3.0-SNAPSHOT
[INFO] [install:install {execution: default-install}]
[INFO] Installing /home/geronimo/geronimo/trunk/testsuite/javaee6-testsuite/servlet3.0-test/fragment2/target/fragment2-3.0-SNAPSHOT.jar
to /home/geronimo/.m2/repository/org/apache/geronimo/testsuite/fragment2/3.0-SNAPSHOT/fragment2-3.0-SNAPSHOT.jar
[INFO] ------------------------------------------------------------------------
[INFO] Building Geronimo TestSuite :: Java EE 6 Testsuite :: fragment3
[INFO]    task-segment: [install]
[INFO] ------------------------------------------------------------------------
[INFO] [genesis:validate-configuration {execution: default}]
[INFO] [geronimo-property:set-property {execution: set-property}]
[INFO] [enforcer:enforce {execution: default}]
[INFO] [remote-resources:process {execution: default}]
[INFO] [resources:resources {execution: default-resources}]
[INFO] Using 'UTF-8' encoding to copy filtered resources.
[INFO] Copying 1 resource
[INFO] skip non existing resourceDirectory /home/geronimo/geronimo/trunk/testsuite/javaee6-testsuite/servlet3.0-test/fragment3/src/main/filtered-resources
[INFO] Copying 3 resources
[INFO] [compiler:compile {execution: default-compile}]
[INFO] Compiling 3 source files to /home/geronimo/geronimo/trunk/testsuite/javaee6-testsuite/servlet3.0-test/fragment3/target/classes
[INFO] [resources:testResources {execution: default-testResources}]
[INFO] Using 'UTF-8' encoding to copy filtered resources.
[INFO] skip non existing resourceDirectory /home/geronimo/geronimo/trunk/testsuite/javaee6-testsuite/servlet3.0-test/fragment3/src/test/resources
[INFO] skip non existing resourceDirectory /home/geronimo/geronimo/trunk/testsuite/javaee6-testsuite/servlet3.0-test/fragment3/src/test/filtered-resources
[INFO] Copying 3 resources
[INFO] [compiler:testCompile {execution: default-testCompile}]
[INFO] No sources to compile
[INFO] [surefire:test {execution: default-test}]
[INFO] Tests are skipped.
[INFO] [jar:jar {execution: default-jar}]
[INFO] Building jar: /home/geronimo/geronimo/trunk/testsuite/javaee6-testsuite/servlet3.0-test/fragment3/target/fragment3-3.0-SNAPSHOT.jar
[INFO] [ianal:verify-legal-files {execution: default}]
[WARNING] Skipping verification of legal files in artifacts:
[WARNING]     org.apache.geronimo.testsuite:fragment3:jar:3.0-SNAPSHOT
[INFO] [install:install {execution: default-install}]
[INFO] Installing /home/geronimo/geronimo/trunk/testsuite/javaee6-testsuite/servlet3.0-test/fragment3/target/fragment3-3.0-SNAPSHOT.jar
to /home/geronimo/.m2/repository/org/apache/geronimo/testsuite/fragment3/3.0-SNAPSHOT/fragment3-3.0-SNAPSHOT.jar
[INFO] ------------------------------------------------------------------------
[INFO] Building Geronimo TestSuite :: Java EE 6 Testsuite :: servlet3.0-test-jar
[INFO]    task-segment: [install]
[INFO] ------------------------------------------------------------------------
[INFO] [genesis:validate-configuration {execution: default}]
[INFO] [geronimo-property:set-property {execution: set-property}]
[INFO] [enforcer:enforce {execution: default}]
[INFO] [remote-resources:process {execution: default}]
[INFO] [resources:resources {execution: default-resources}]
[INFO] Using 'UTF-8' encoding to copy filtered resources.
[INFO] Copying 1 resource
[INFO] skip non existing resourceDirectory /home/geronimo/geronimo/trunk/testsuite/javaee6-testsuite/servlet3.0-test/servlet3.0-test-jar/src/main/filtered-resources
[INFO] Copying 3 resources
[INFO] [compiler:compile {execution: default-compile}]
[INFO] No sources to compile
[INFO] [resources:testResources {execution: default-testResources}]
[INFO] Using 'UTF-8' encoding to copy filtered resources.
[INFO] skip non existing resourceDirectory /home/geronimo/geronimo/trunk/testsuite/javaee6-testsuite/servlet3.0-test/servlet3.0-test-jar/src/test/resources
[INFO] skip non existing resourceDirectory /home/geronimo/geronimo/trunk/testsuite/javaee6-testsuite/servlet3.0-test/servlet3.0-test-jar/src/test/filtered-resources
[INFO] Copying 3 resources
[INFO] [compiler:testCompile {execution: default-testCompile}]
[INFO] No sources to compile
[INFO] [surefire:test {execution: default-test}]
[INFO] Tests are skipped.
[INFO] [jar:jar {execution: default-jar}]
[INFO] Building jar: /home/geronimo/geronimo/trunk/testsuite/javaee6-testsuite/servlet3.0-test/servlet3.0-test-jar/target/servlet3.0-test-jar-3.0-SNAPSHOT.jar
[INFO] [ianal:verify-legal-files {execution: default}]
[WARNING] Skipping verification of legal files in artifacts:
[WARNING]     org.apache.geronimo.testsuite:servlet3.0-test-jar:jar:3.0-SNAPSHOT
[INFO] [install:install {execution: default-install}]
[INFO] Installing /home/geronimo/geronimo/trunk/testsuite/javaee6-testsuite/servlet3.0-test/servlet3.0-test-jar/target/servlet3.0-test-jar-3.0-SNAPSHOT.jar
to /home/geronimo/.m2/repository/org/apache/geronimo/testsuite/servlet3.0-test-jar/3.0-SNAPSHOT/servlet3.0-test-jar-3.0-SNAPSHOT.jar
[INFO] ------------------------------------------------------------------------
[INFO] Building Geronimo TestSuite :: Java EE 6 Testsuite :: servlet3.0-test-war
[INFO]    task-segment: [install]
[INFO] ------------------------------------------------------------------------
[INFO] [genesis:validate-configuration {execution: default}]
[INFO] [geronimo-property:set-property {execution: set-property}]
[INFO] [enforcer:enforce {execution: default}]
[INFO] [remote-resources:process {execution: default}]
[INFO] [resources:resources {execution: default-resources}]
[INFO] Using 'UTF-8' encoding to copy filtered resources.
[INFO] Copying 1 resource
[INFO] skip non existing resourceDirectory /home/geronimo/geronimo/trunk/testsuite/javaee6-testsuite/servlet3.0-test/servlet3.0-test-war/src/main/filtered-resources
[INFO] Copying 3 resources
[INFO] [compiler:compile {execution: default-compile}]
[INFO] Compiling 15 source files to /home/geronimo/geronimo/trunk/testsuite/javaee6-testsuite/servlet3.0-test/servlet3.0-test-war/target/classes
[INFO] [selenium:xvfb {execution: xvfb}]
[INFO] Starting Xvfb...
[INFO] ------------------------------------------------------------------------
[ERROR] BUILD ERROR
 
Samples: trunk
=================================
Log: http://people.apache.org/builds/geronimo/server/binaries/trunk/20101012/samples-2100.log
 
Build status: OK
 

Mime
View raw message