geronimo-dev mailing list archives

Site index · List index
Message view « Date » · « Thread »
Top « Date » · « Thread »
From ga...@apache.org
Subject [BUILD] branches/2.1: Failed for Revision: 1006251
Date Sun, 10 Oct 2010 15:12:46 GMT
Geronimo Revision: 1006251 built with tests included
 
See the full build-0200.log file at http://people.apache.org/builds/geronimo/server/binaries/2.1/20101010/build-0200.log
 
Download the binaries from http://people.apache.org/builds/geronimo/server/binaries/2.1/20101010
[INFO] BUILD SUCCESSFUL
[INFO] ------------------------------------------------------------------------
[INFO] Total time: 393 minutes 45 seconds
[INFO] Finished at: Sun Oct 10 08:39:45 EDT 2010
[INFO] Final Memory: 275M/1013M
[INFO] ------------------------------------------------------------------------
 
TESTSUITE RESULTS (Failures only)
=================================
 
Assembly: tomcat
=================================
See full test results and logs at http://people.apache.org/builds/geronimo/server/binaries/2.1/20101010/logs-0200-tomcat/
 
[INFO] Running console-testsuite.basic-console
[INFO] Tests run: 110, Failures: 3, Errors: 0, Skipped: 107, Time elapsed: 3.593 sec <<<
FAILURE!
[INFO] Running console-testsuite.advance-test
[INFO] Tests run: 15, Failures: 15, Errors: 0, Skipped: 0, Time elapsed: 8.596 sec <<<
FAILURE!
--
[INFO] Running security-testsuite.security
[INFO] Tests run: 36, Failures: 2, Errors: 0, Skipped: 0, Time elapsed: 60.75 sec <<<
FAILURE!
 
Assembly: jetty
=================================
See full test results and logs at http://people.apache.org/builds/geronimo/server/binaries/2.1/20101010/logs-0200-jetty/
 
[INFO] Running console-testsuite.basic-console
[INFO] Tests run: 110, Failures: 3, Errors: 0, Skipped: 107, Time elapsed: 3.354 sec <<<
FAILURE!
[INFO] Running console-testsuite.advance-test
[INFO] Tests run: 15, Failures: 15, Errors: 0, Skipped: 0, Time elapsed: 8.68 sec <<<
FAILURE!
--
[INFO] Running security-testsuite.security
[INFO] Tests run: 36, Failures: 1, Errors: 0, Skipped: 0, Time elapsed: 9.171 sec <<<
FAILURE!
 
Samples: branches/2.1
=================================
Log: http://people.apache.org/builds/geronimo/server/binaries/2.1/20101010/samples-0200.log
 
Build status: FAILED
 

Mime
View raw message