geronimo-dev mailing list archives

Site index · List index
Message view « Date » · « Thread »
Top « Date » · « Thread »
From ga...@apache.org
Subject [BUILD] branches/2.2: Failed for Revision: 1005185
Date Wed, 06 Oct 2010 20:28:00 GMT
Geronimo Revision: 1005185 built with tests included
 
See the full build-1400.log file at http://people.apache.org/builds/geronimo/server/binaries/2.2/20101006/build-1400.log
 
Download the binaries from http://people.apache.org/builds/geronimo/server/binaries/2.2/20101006
[INFO] BUILD SUCCESSFUL
[INFO] ------------------------------------------------------------------------
[INFO] Total time: 40 minutes 2 seconds
[INFO] Finished at: Wed Oct 06 14:47:35 EDT 2010
[INFO] Final Memory: 312M/995M
[INFO] ------------------------------------------------------------------------
 
TESTSUITE RESULTS (Failures only)
=================================
 
Assembly: tomcat
=================================
See full test results and logs at http://people.apache.org/builds/geronimo/server/binaries/2.2/20101006/logs-1400-tomcat/
 
[INFO] Running TestSuite
[INFO] Tests run: 116, Failures: 3, Errors: 0, Skipped: 113, Time elapsed: 16.229 sec <<<
FAILURE!
[INFO] Running TestSuite
[INFO] Tests run: 36, Failures: 1, Errors: 0, Skipped: 35, Time elapsed: 8.995 sec <<<
FAILURE!
--
[INFO] Running TestSuite
[INFO] Tests run: 36, Failures: 2, Errors: 0, Skipped: 0, Time elapsed: 67.199 sec <<<
FAILURE!
 
[INFO] [WARNING]     org.superbiz.load:loadbean:jar:2.2.1-SNAPSHOT
[INFO] [INFO] [install:install {execution: default-install}]
[INFO] [INFO] Installing /home/geronimo/geronimo/2.2/testsuite/cluster-testsuite/ejb-loadbean/target/loadbean-2.2.1-SNAPSHOT.jar
to /home/geronimo/.m2/repository/org/superbiz/load/loadbean/2.2.1-SNAPSHOT/loadbean-2.2.1-SNAPSHOT.jar
[INFO] [INFO] ------------------------------------------------------------------------
[INFO] [INFO] BUILD SUCCESSFUL
[INFO] [INFO] ------------------------------------------------------------------------
[INFO] [INFO] Total time: 8 seconds
[INFO] [INFO] Finished at: Wed Oct 06 16:00:39 EDT 2010
[INFO] [INFO] Final Memory: 30M/552M
[INFO] [INFO] ------------------------------------------------------------------------
[INFO] Invoking: /home/geronimo/geronimo/2.2/testsuite/cluster-testsuite/ejb-multicast/pom.xml
[INFO] + Error stacktraces are turned on.
[INFO] [INFO] Scanning for projects...
[INFO] [INFO] ------------------------------------------------------------------------
[INFO] [INFO] Building Geronimo TestSuite :: Cluster Testsuite :: EJB Multicast Tests
[INFO] [INFO]    task-segment: [install]
[INFO] [INFO] ------------------------------------------------------------------------
[INFO] [INFO] [genesis:validate-configuration {execution: default}]
[INFO] [INFO] snapshot org.superbiz.load:loadbean:2.2.1-SNAPSHOT: checking for updates from
codehaus.snapshots
[INFO] [INFO] snapshot org.superbiz.load:loadbean:2.2.1-SNAPSHOT: checking for updates from
apache.snapshots
[INFO] [INFO] [enforcer:enforce {execution: default}]
[INFO] [INFO] Setting property: classpath.resource.loader.class => 'org.codehaus.plexus.velocity.ContextClassLoaderResourceLoader'.
[INFO] [INFO] Setting property: velocimacro.messages.on => 'false'.
[INFO] [INFO] Setting property: resource.loader => 'classpath'.
[INFO] [INFO] Setting property: resource.manager.logwhenfound => 'false'.
[INFO] [INFO] [remote-resources:process {execution: default}]
[INFO] [INFO] [resources:resources {execution: default-resources}]
[INFO] [INFO] Using 'UTF-8' encoding to copy filtered resources.
[INFO] [INFO] Copying 1 resource
[INFO] [INFO] skip non existing resourceDirectory /home/geronimo/geronimo/2.2/testsuite/cluster-testsuite/ejb-multicast/src/main/filtered-resources
[INFO] [INFO] Copying 3 resources
[INFO] [INFO] [compiler:compile {execution: default-compile}]
[INFO] [INFO] No sources to compile
[INFO] [INFO] [resources:testResources {execution: default-testResources}]
[INFO] [INFO] Using 'UTF-8' encoding to copy filtered resources.
[INFO] [INFO] skip non existing resourceDirectory /home/geronimo/geronimo/2.2/testsuite/cluster-testsuite/ejb-multicast/src/test/resources
[INFO] [INFO] skip non existing resourceDirectory /home/geronimo/geronimo/2.2/testsuite/cluster-testsuite/ejb-multicast/src/test/filtered-resources
[INFO] [INFO] Copying 3 resources
[INFO] [INFO] [antrun:run {execution: create-server-instance}]
[INFO] [INFO] Executing tasks
[INFO] 
[INFO] linux:
[INFO]      [echo] #################################################################################
[INFO]      [echo] ##                                                                    
          
[INFO]      [echo] ## Unzipping: assembly                                                

[INFO]      [echo] ##                                                                    
          
[INFO]      [echo] #################################################################################
[INFO]     [mkdir] Created dir: /home/geronimo/geronimo/2.2/testsuite/cluster-testsuite/ejb-multicast/target/server1
[INFO]    [gunzip] Expanding /home/geronimo/.m2/repository/org/apache/geronimo/assemblies/geronimo-tomcat6-javaee5/2.2.1-SNAPSHOT/geronimo-tomcat6-javaee5-2.2.1-SNAPSHOT-bin.tar.gz
to /home/geronimo/geronimo/2.2/testsuite/cluster-testsuite/ejb-multicast/target/server1/geronimo-tomcat6-javaee5-2.2.1-SNAPSHOT-bin.tar
[INFO]     [untar] Expanding: /home/geronimo/geronimo/2.2/testsuite/cluster-testsuite/ejb-multicast/target/server1/geronimo-tomcat6-javaee5-2.2.1-SNAPSHOT-bin.tar
into /home/geronimo/geronimo/2.2/testsuite/cluster-testsuite/ejb-multicast/target/server1
[INFO]      [copy] Copying 4577 files to /home/geronimo/geronimo/2.2/testsuite/cluster-testsuite/ejb-multicast/target/server1
[INFO]      [copy] Copied 1858 empty directories to 16 empty directories under /home/geronimo/geronimo/2.2/testsuite/cluster-testsuite/ejb-multicast/target/server1
[INFO]    [delete] Deleting directory /home/geronimo/geronimo/2.2/testsuite/cluster-testsuite/ejb-multicast/target/server1/geronimo-tomcat6-javaee5-2.2.1-SNAPSHOT
[INFO]     [mkdir] Created dir: /home/geronimo/geronimo/2.2/testsuite/cluster-testsuite/ejb-multicast/target/server2
[INFO]      [copy] Copying 4578 files to /home/geronimo/geronimo/2.2/testsuite/cluster-testsuite/ejb-multicast/target/server2
[INFO]      [copy] Copied 1858 empty directories to 17 empty directories under /home/geronimo/geronimo/2.2/testsuite/cluster-testsuite/ejb-multicast/target/server2
[INFO] [INFO] Executed tasks
[INFO] [INFO] [geronimo:start-server {execution: start-server1}]
[INFO] [INFO] Using pre-installed assembly: /home/geronimo/geronimo/2.2/testsuite/cluster-testsuite/ejb-multicast/target/server1
[INFO] [INFO] Installation type is pre-existing; skipping installation
[INFO] [INFO] ------------------------------------------------------------------------
[INFO] [ERROR] FATAL ERROR
[INFO] [INFO] ------------------------------------------------------------------------
[INFO] [INFO] Requested factory com.ctc.wstx.stax.WstxInputFactory cannot be located.  Classloader
=org.codehaus.classworlds.RealmClassLoader@1ad6b4b
[INFO] [INFO] ------------------------------------------------------------------------
[INFO] [INFO] Trace
[INFO] javax.xml.stream.FactoryConfigurationError: Requested factory com.ctc.wstx.stax.WstxInputFactory
cannot be located.  Classloader =org.codehaus.classworlds.RealmClassLoader@1ad6b4b
[INFO] 	at javax.xml.stream.FactoryLocator.loadFactory(FactoryLocator.java:120)
[INFO] 	at javax.xml.stream.FactoryLocator.locate(FactoryLocator.java:109)
[INFO] 	at javax.xml.stream.FactoryLocator.locate(FactoryLocator.java:54)
[INFO] 	at javax.xml.stream.XMLInputFactory.newInstance(XMLInputFactory.java:41)
[INFO] 	at org.apache.geronimo.system.configuration.AttributesXmlUtil.<clinit>(AttributesXmlUtil.java:49)
[INFO] 	at org.apache.geronimo.mavenplugins.geronimo.server.ServerOverride.getOverrides(ServerOverride.java:40)
[INFO] 	at org.apache.geronimo.mavenplugins.geronimo.server.StartServerMojo.doExecute(StartServerMojo.java:206)
[INFO] 	at org.apache.geronimo.mavenplugins.geronimo.reporting.ReportingMojoSupport.execute(ReportingMojoSupport.java:99)
[INFO] 	at org.apache.maven.plugin.DefaultPluginManager.executeMojo(DefaultPluginManager.java:490)
[INFO] 	at org.apache.maven.lifecycle.DefaultLifecycleExecutor.executeGoals(DefaultLifecycleExecutor.java:694)
[INFO] 	at org.apache.maven.lifecycle.DefaultLifecycleExecutor.executeGoalWithLifecycle(DefaultLifecycleExecutor.java:556)
[INFO] 	at org.apache.maven.lifecycle.DefaultLifecycleExecutor.executeGoal(DefaultLifecycleExecutor.java:535)
[INFO] 	at org.apache.maven.lifecycle.DefaultLifecycleExecutor.executeGoalAndHandleFailures(DefaultLifecycleExecutor.java:387)
[INFO] 	at org.apache.maven.lifecycle.DefaultLifecycleExecutor.executeTaskSegments(DefaultLifecycleExecutor.java:348)
[INFO] 	at org.apache.maven.lifecycle.DefaultLifecycleExecutor.execute(DefaultLifecycleExecutor.java:180)
[INFO] 	at org.apache.maven.DefaultMaven.doExecute(DefaultMaven.java:328)
[INFO] 	at org.apache.maven.DefaultMaven.execute(DefaultMaven.java:138)
[INFO] 	at org.apache.maven.cli.MavenCli.main(MavenCli.java:362)
[INFO] 	at org.apache.maven.cli.compat.CompatibleMain.main(CompatibleMain.java:60)
[INFO] 	at sun.reflect.NativeMethodAccessorImpl.invoke0(Native Method)
[INFO] 	at sun.reflect.NativeMethodAccessorImpl.invoke(NativeMethodAccessorImpl.java:39)
[INFO] 	at sun.reflect.DelegatingMethodAccessorImpl.invoke(DelegatingMethodAccessorImpl.java:25)
[INFO] 	at java.lang.reflect.Method.invoke(Method.java:585)
[INFO] 	at org.codehaus.classworlds.Launcher.launchEnhanced(Launcher.java:315)
[INFO] 	at org.codehaus.classworlds.Launcher.launch(Launcher.java:255)
[INFO] 	at org.codehaus.classworlds.Launcher.mainWithExitCode(Launcher.java:430)
[INFO] 	at org.codehaus.classworlds.Launcher.main(Launcher.java:375)
[INFO] [INFO] ------------------------------------------------------------------------
[INFO] [INFO] Total time: 1 minute 23 seconds
[INFO] [INFO] Finished at: Wed Oct 06 16:02:04 EDT 2010
[INFO] [INFO] Final Memory: 53M/541M
[INFO] [INFO] ------------------------------------------------------------------------
[INFO] ------------------------------------------------------------------------
[ERROR] BUILD ERROR
 
Assembly: jetty
=================================
See full test results and logs at http://people.apache.org/builds/geronimo/server/binaries/2.2/20101006/logs-1400-jetty/
 
[INFO] Running TestSuite
[INFO] Tests run: 116, Failures: 3, Errors: 0, Skipped: 113, Time elapsed: 11.897 sec <<<
FAILURE!
[INFO] Running TestSuite
[INFO] Tests run: 36, Failures: 1, Errors: 0, Skipped: 35, Time elapsed: 8.542 sec <<<
FAILURE!
--
[INFO] Running TestSuite
[INFO] Tests run: 2, Failures: 2, Errors: 0, Skipped: 0, Time elapsed: 7.791 sec <<<
FAILURE!
 
[INFO] [INFO] Could not find manifest file: /home/geronimo/geronimo/2.2/testsuite/deployment-testsuite/jca-cms-tests/jca-cms-ear/src/main/application/META-INF/MANIFEST.MF
- Generating one
[INFO] [INFO] Building jar: /home/geronimo/geronimo/2.2/testsuite/deployment-testsuite/jca-cms-tests/jca-cms-ear/target/jca-cms-ear-2.2.1-SNAPSHOT.ear
[INFO] [INFO] [selenium:start-server {execution: start}]
[INFO] Launching Selenium Server
[INFO] Waiting for Selenium Server...
[INFO] [INFO] Including display properties from: /home/geronimo/geronimo/2.2/testsuite/deployment-testsuite/jca-cms-tests/jca-cms-ear/target/selenium/display.properties
[INFO] [INFO] Redirecting output to: /home/geronimo/geronimo/2.2/testsuite/deployment-testsuite/jca-cms-tests/jca-cms-ear/target/selenium/server.log
[INFO] [INFO] User extensions: /home/geronimo/geronimo/2.2/testsuite/deployment-testsuite/jca-cms-tests/jca-cms-ear/target/selenium/user-extensions.js
[INFO] Selenium Server started
[INFO] [INFO] [geronimo:deploy-module {execution: deploy-ears}]
[INFO] [INFO] Using non-artifact based module archive: /home/geronimo/geronimo/2.2/testsuite/deployment-testsuite/jca-cms-tests/jca-cms-ear/target/jca-cms-ear-2.2.1-SNAPSHOT.ear
[INFO] [INFO] Distributing module artifact: /home/geronimo/geronimo/2.2/testsuite/deployment-testsuite/jca-cms-tests/jca-cms-ear/target/jca-cms-ear-2.2.1-SNAPSHOT.ear
[INFO] [INFO] Starting modules...
[INFO] [INFO] Starting module: org.apache.geronimo.testsuite/jca-cms-ear/2.2.1-SNAPSHOT/ear
[INFO] [INFO] Started module(s):
[INFO] [INFO]     [0] org.apache.geronimo.testsuite/jca-cms-ear/2.2.1-SNAPSHOT/ear
[INFO] [INFO] [failsafe:integration-test {execution: integration-test}]
[INFO] [INFO] Failsafe report directory: /home/geronimo/geronimo/2.2/testsuite/deployment-testsuite/jca-cms-tests/jca-cms-ear/target/failsafe-reports
[INFO] 
[INFO] -------------------------------------------------------
[INFO]  T E S T S
[INFO] -------------------------------------------------------
[INFO] Running TestSuite
[INFO] Tests run: 2, Failures: 2, Errors: 0, Skipped: 0, Time elapsed: 7.791 sec <<<
FAILURE!
[INFO] 
[INFO] Results :
[INFO] 
[INFO] Failed tests: 
[INFO]   testPageContent1(org.apache.geronimo.testsuite.jcacms.CmsTest)
[INFO]   testPageContent2(org.apache.geronimo.testsuite.jcacms.CmsTest)
[INFO] 
[INFO] Tests run: 2, Failures: 2, Errors: 0, Skipped: 0
[INFO] 
[INFO] [WARNING] File encoding has not been set, using platform encoding ANSI_X3.4-1968, i.e.
build is platform dependent!
[INFO] [INFO] [selenium:stop-server {execution: stop}]
[INFO] Stopping Selenium server...
[INFO] Stop request sent
[INFO] [INFO] [geronimo:undeploy-module {execution: undeploy-ear-as-module}]
[INFO] [INFO] Using non-artifact based module id: org.apache.geronimo.testsuite/jca-cms-ear/2.2.1-SNAPSHOT/ear
[INFO] [INFO] Stopping module: org.apache.geronimo.testsuite/jca-cms-ear/2.2.1-SNAPSHOT/ear
[INFO] [INFO] Stopped module(s):
[INFO] [INFO]     [0] org.apache.geronimo.testsuite/jca-cms-ear/2.2.1-SNAPSHOT/ear
[INFO] [INFO]         [0] web.war; URL: /jca-cms
[INFO] [INFO]         [1] tranql.rar
[INFO] [INFO] Undeploying module: org.apache.geronimo.testsuite/jca-cms-ear/2.2.1-SNAPSHOT/ear
[INFO] [INFO] Undeployed module(s):
[INFO] [INFO]     [0] org.apache.geronimo.testsuite/jca-cms-ear/2.2.1-SNAPSHOT/ear
[INFO] [INFO] [failsafe:verify {execution: verify}]
[INFO] [INFO] Failsafe report directory: /home/geronimo/geronimo/2.2/testsuite/deployment-testsuite/jca-cms-tests/jca-cms-ear/target/failsafe-reports
[INFO] [WARNING] File encoding has not been set, using platform encoding ANSI_X3.4-1968, i.e.
build is platform dependent!
[INFO] [ERROR] There are test failures.
[INFO] 
[INFO] Please refer to /home/geronimo/geronimo/2.2/testsuite/deployment-testsuite/jca-cms-tests/jca-cms-ear/target/failsafe-reports
for the individual test results.
[INFO] [INFO] [ianal:verify-legal-files {execution: default}]
[INFO] [WARNING] Skipping verification of legal files in artifacts:
[INFO] [WARNING]     org.apache.geronimo.testsuite:jca-cms-ear:ear:2.2.1-SNAPSHOT
[INFO] [INFO] [install:install {execution: default-install}]
[INFO] [INFO] Installing /home/geronimo/geronimo/2.2/testsuite/deployment-testsuite/jca-cms-tests/jca-cms-ear/target/jca-cms-ear-2.2.1-SNAPSHOT.ear
to /home/geronimo/.m2/repository/org/apache/geronimo/testsuite/jca-cms-ear/2.2.1-SNAPSHOT/jca-cms-ear-2.2.1-SNAPSHOT.ear
[INFO] [INFO] 
[INFO] [INFO] 
[INFO] [INFO] ------------------------------------------------------------------------
[INFO] [INFO] Reactor Summary:
[INFO] [INFO] ------------------------------------------------------------------------
[INFO] [INFO] Geronimo TestSuite :: Deployment Testsuite :: J2CA Container Managed Security
Test  SUCCESS [7.593s]
[INFO] [INFO] Geronimo TestSuite :: Deployment Testsuite :: J2CA Container Managed Security
WAR  SUCCESS [2.215s]
[INFO] [INFO] Geronimo TestSuite :: Deployment Testsuite :: J2CA Container Managed Security
EAR  SUCCESS [28.330s]
[INFO] [INFO] ------------------------------------------------------------------------
[INFO] [INFO] ------------------------------------------------------------------------
[INFO] [INFO] BUILD SUCCESSFUL
[INFO] [INFO] ------------------------------------------------------------------------
[INFO] [INFO] Total time: 39 seconds
[INFO] [INFO] Finished at: Wed Oct 06 16:31:39 EDT 2010
[INFO] [INFO] Final Memory: 51M/551M
[INFO] [INFO] ------------------------------------------------------------------------
[INFO] [ianal:verify-legal-files {execution: default}]
[INFO] [install:install {execution: default-install}]
[INFO] Installing /home/geronimo/geronimo/2.2/testsuite/deployment-testsuite/pom.xml to /home/geronimo/.m2/repository/org/apache/geronimo/testsuite/deployment-testsuite/2.2.1-SNAPSHOT/deployment-testsuite-2.2.1-SNAPSHOT.pom
[INFO] [geronimo:stop-server {execution: stop}]
[INFO] Stopping Geronimo server...
[INFO] ------------------------------------------------------------------------
[INFO] Building Geronimo TestSuite :: Enterprise Testsuite
[INFO]    task-segment: [install]
[INFO] ------------------------------------------------------------------------
[INFO] [genesis:validate-configuration {execution: default}]
[INFO] [enforcer:enforce {execution: default}]
[INFO] [remote-resources:process {execution: default}]
[INFO] [site:attach-descriptor {execution: default-attach-descriptor}]
[INFO] [install:install {execution: install-ahead}]
[INFO] Installing /home/geronimo/geronimo/2.2/testsuite/enterprise-testsuite/pom.xml to /home/geronimo/.m2/repository/org/apache/geronimo/testsuite/enterprise-testsuite/2.2.1-SNAPSHOT/enterprise-testsuite-2.2.1-SNAPSHOT.pom
[INFO] [geronimo:start-server {execution: start}]
[INFO] Using assembly configuration: jetty
[INFO] Using assembly artifact: org.apache.geronimo.assemblies:geronimo-jetty7-javaee5:zip:bin:2.2.1-SNAPSHOT:provided
[INFO] Using geronimoHome: /home/geronimo/geronimo/2.2/testsuite/enterprise-testsuite/target/geronimo-jetty7-javaee5-2.2.1-SNAPSHOT
[INFO] Installing assembly...
[INFO] Expanding: /home/geronimo/.m2/repository/org/apache/geronimo/assemblies/geronimo-jetty7-javaee5/2.2.1-SNAPSHOT/geronimo-jetty7-javaee5-2.2.1-SNAPSHOT-bin.zip
into /home/geronimo/geronimo/2.2/testsuite/enterprise-testsuite/target
[INFO] Starting Geronimo server...
[INFO] Selected option set: default
[INFO] Redirecting output to: /home/geronimo/geronimo/2.2/testsuite/enterprise-testsuite/target/geronimo-logs/org.apache.geronimo.mavenplugins.geronimo.server.StartServerMojo.log
[INFO] Waiting for Geronimo server...
[INFO] ------------------------------------------------------------------------
[ERROR] BUILD ERROR
 
Samples: branches/2.2
=================================
Log: http://people.apache.org/builds/geronimo/server/binaries/2.2/20101006/samples-1400.log
 
Build status: FAILED
 

Mime
View raw message