geronimo-dev mailing list archives

Site index · List index
Message view « Date » · « Thread »
Top « Date » · « Thread »
From ga...@apache.org
Subject [BUILD] trunk: Failed for Revision: 1003407
Date Fri, 01 Oct 2010 07:27:42 GMT
Geronimo Revision: 1003407 built with tests included
 
See the full build-0300.log file at http://people.apache.org/builds/geronimo/server/binaries/trunk/20101001/build-0300.log
 
 
See the unit test reports at http://people.apache.org/builds/geronimo/server/binaries/trunk/20101001/unit-test-reports
 

[INFO] [bundle:bundle {execution: default-bundle}]
[INFO] [geronimo-osgi:verify-manifest {execution: verify-manifest}]
[INFO] Resolving OSGi bundle: org.apache.geronimo.modules.geronimo-test-ddbean
[INFO] OSGi bundle is resolved: org.apache.geronimo.modules.geronimo-test-ddbean
[INFO] [ianal:verify-legal-files {execution: default}]
[INFO] Checking legal files in: geronimo-test-ddbean-3.0-SNAPSHOT.jar
[INFO] [install:install {execution: default-install}]
[INFO] Installing /home/geronimo/geronimo/trunk/plugins/j2ee/geronimo-test-ddbean/target/geronimo-test-ddbean-3.0-SNAPSHOT.jar
to /home/geronimo/.m2/repository/org/apache/geronimo/modules/geronimo-test-ddbean/3.0-SNAPSHOT/geronimo-test-ddbean-3.0-SNAPSHOT.jar
[INFO] [bundle:install {execution: default-install}]
[INFO] Parsing file:/home/geronimo/.m2/repository/repository.xml
[INFO] Installing org/apache/geronimo/modules/geronimo-test-ddbean/3.0-SNAPSHOT/geronimo-test-ddbean-3.0-SNAPSHOT.jar
[INFO] Writing OBR metadata
[INFO] ------------------------------------------------------------------------
[INFO] Building Geronimo Plugins, J2EE :: Web 2.5 Builder
[INFO]    task-segment: [install]
[INFO] ------------------------------------------------------------------------
[INFO] [genesis:validate-configuration {execution: default}]
[INFO] [geronimo-property:set-property {execution: set-property}]
[INFO] snapshot org.apache.geronimo.modules:geronimo-web:3.0-SNAPSHOT: checking for updates
from jetty.oss.sonatype.org
[INFO] snapshot org.apache.geronimo.modules:geronimo-web:3.0-SNAPSHOT: checking for updates
from openqa-snapshots
[INFO] snapshot org.apache.geronimo.modules:geronimo-web:3.0-SNAPSHOT: checking for updates
from codehaus.snapshots
[INFO] snapshot org.apache.geronimo.modules:geronimo-web:3.0-SNAPSHOT: checking for updates
from apache.snapshots
[INFO] snapshot org.apache.geronimo.modules:geronimo-naming-builder:3.0-SNAPSHOT: checking
for updates from jetty.oss.sonatype.org
[INFO] snapshot org.apache.geronimo.modules:geronimo-naming-builder:3.0-SNAPSHOT: checking
for updates from openqa-snapshots
[INFO] snapshot org.apache.geronimo.modules:geronimo-naming-builder:3.0-SNAPSHOT: checking
for updates from codehaus.snapshots
[INFO] snapshot org.apache.geronimo.modules:geronimo-naming-builder:3.0-SNAPSHOT: checking
for updates from apache.snapshots
[INFO] snapshot org.apache.geronimo.modules:geronimo-security-builder:3.0-SNAPSHOT: checking
for updates from jetty.oss.sonatype.org
[INFO] snapshot org.apache.geronimo.modules:geronimo-security-builder:3.0-SNAPSHOT: checking
for updates from openqa-snapshots
[INFO] snapshot org.apache.geronimo.modules:geronimo-security-builder:3.0-SNAPSHOT: checking
for updates from codehaus.snapshots
[INFO] snapshot org.apache.geronimo.modules:geronimo-security-builder:3.0-SNAPSHOT: checking
for updates from apache.snapshots
[INFO] snapshot org.apache.geronimo.modules:geronimo-test-ddbean:3.0-SNAPSHOT: checking for
updates from jetty.oss.sonatype.org
[INFO] snapshot org.apache.geronimo.modules:geronimo-test-ddbean:3.0-SNAPSHOT: checking for
updates from openqa-snapshots
[INFO] snapshot org.apache.geronimo.modules:geronimo-test-ddbean:3.0-SNAPSHOT: checking for
updates from codehaus.snapshots
[INFO] snapshot org.apache.geronimo.modules:geronimo-test-ddbean:3.0-SNAPSHOT: checking for
updates from apache.snapshots
[INFO] [enforcer:enforce {execution: default}]
[INFO] [xmlbeans:xmlbeans {execution: default}]
Time to build schema type system: 0.603 seconds
Time to generate code: 0.175 seconds
Time to compile code: 2.135 seconds
[INFO] [remote-resources:process {execution: default}]
[INFO] [resources:resources {execution: default-resources}]
[INFO] Using 'UTF-8' encoding to copy filtered resources.
[INFO] skip non existing resourceDirectory /home/geronimo/geronimo/trunk/plugins/j2ee/geronimo-web-2.5-builder/src/main/resources
[INFO] skip non existing resourceDirectory /home/geronimo/geronimo/trunk/plugins/j2ee/geronimo-web-2.5-builder/src/main/filtered-resources
[INFO] Copying 94 resources
[INFO] Copying 3 resources
[INFO] [compiler:compile {execution: default-compile}]
[INFO] Compiling 62 source files to /home/geronimo/geronimo/trunk/plugins/j2ee/geronimo-web-2.5-builder/target/classes
[INFO] ------------------------------------------------------------------------
[ERROR] BUILD FAILURE
[INFO] ------------------------------------------------------------------------
[INFO] Compilation failure
/home/geronimo/geronimo/trunk/plugins/j2ee/geronimo-web-2.5-builder/src/main/java/org/apache/geronimo/web25/deployment/WebAppInfoBuilder.java:[249,95]
incompatible types
found   : java.lang.Number&java.lang.Comparable<? extends java.lang.Number&java.lang.Comparable<?>>
required: int


[INFO] ------------------------------------------------------------------------
[INFO] Trace
org.apache.maven.BuildFailureException: Compilation failure
/home/geronimo/geronimo/trunk/plugins/j2ee/geronimo-web-2.5-builder/src/main/java/org/apache/geronimo/web25/deployment/WebAppInfoBuilder.java:[249,95]
incompatible types
found   : java.lang.Number&java.lang.Comparable<? extends java.lang.Number&java.lang.Comparable<?>>
required: int


	at org.apache.maven.lifecycle.DefaultLifecycleExecutor.executeGoals(DefaultLifecycleExecutor.java:715)
	at org.apache.maven.lifecycle.DefaultLifecycleExecutor.executeGoalWithLifecycle(DefaultLifecycleExecutor.java:556)
	at org.apache.maven.lifecycle.DefaultLifecycleExecutor.executeGoal(DefaultLifecycleExecutor.java:535)
	at org.apache.maven.lifecycle.DefaultLifecycleExecutor.executeGoalAndHandleFailures(DefaultLifecycleExecutor.java:387)
	at org.apache.maven.lifecycle.DefaultLifecycleExecutor.executeTaskSegments(DefaultLifecycleExecutor.java:348)
	at org.apache.maven.lifecycle.DefaultLifecycleExecutor.execute(DefaultLifecycleExecutor.java:180)
	at org.apache.maven.DefaultMaven.doExecute(DefaultMaven.java:328)
	at org.apache.maven.DefaultMaven.execute(DefaultMaven.java:138)
	at org.apache.maven.cli.MavenCli.main(MavenCli.java:362)
	at org.apache.maven.cli.compat.CompatibleMain.main(CompatibleMain.java:60)
	at sun.reflect.NativeMethodAccessorImpl.invoke0(Native Method)
	at sun.reflect.NativeMethodAccessorImpl.invoke(NativeMethodAccessorImpl.java:39)
	at sun.reflect.DelegatingMethodAccessorImpl.invoke(DelegatingMethodAccessorImpl.java:25)
	at java.lang.reflect.Method.invoke(Method.java:597)
	at org.codehaus.classworlds.Launcher.launchEnhanced(Launcher.java:315)
	at org.codehaus.classworlds.Launcher.launch(Launcher.java:255)
	at org.codehaus.classworlds.Launcher.mainWithExitCode(Launcher.java:430)
	at org.codehaus.classworlds.Launcher.main(Launcher.java:375)
Caused by: org.apache.maven.plugin.CompilationFailureException: Compilation failure
/home/geronimo/geronimo/trunk/plugins/j2ee/geronimo-web-2.5-builder/src/main/java/org/apache/geronimo/web25/deployment/WebAppInfoBuilder.java:[249,95]
incompatible types
found   : java.lang.Number&java.lang.Comparable<? extends java.lang.Number&java.lang.Comparable<?>>
required: int


	at org.apache.maven.plugin.AbstractCompilerMojo.execute(AbstractCompilerMojo.java:516)
	at org.apache.maven.plugin.CompilerMojo.execute(CompilerMojo.java:114)
	at org.apache.maven.plugin.DefaultPluginManager.executeMojo(DefaultPluginManager.java:490)
	at org.apache.maven.lifecycle.DefaultLifecycleExecutor.executeGoals(DefaultLifecycleExecutor.java:694)
	... 17 more
[INFO] ------------------------------------------------------------------------
[INFO] Total time: 15 minutes 15 seconds
[INFO] Finished at: Fri Oct 01 03:16:26 EDT 2010
[INFO] Final Memory: 500M/993M
[INFO] ------------------------------------------------------------------------

Mime
View raw message