geronimo-dev mailing list archives

Site index · List index
Message view « Date » · « Thread »
Top « Date » · « Thread »
From Jarek Gawor <jga...@gmail.com>
Subject Re: [BUILD] trunk: Failed for Revision: 995685
Date Fri, 10 Sep 2010 13:49:20 GMT
David,

Some of these are regressions (e..g myfaces failures) - can you please
take a look?

Jarek

On Fri, Sep 10, 2010 at 5:39 AM,  <gawor@apache.org> wrote:
> Geronimo Revision: 995685 built with tests included
>
> See the full build-0300.log file at http://people.apache.org/builds/geronimo/server/binaries/trunk/20100910/build-0300.log
>
> Download the binaries from http://people.apache.org/builds/geronimo/server/binaries/trunk/20100910
> [INFO] BUILD SUCCESSFUL
> [INFO] ------------------------------------------------------------------------
> [INFO] Total time: 38 minutes 17 seconds
> [INFO] Finished at: Fri Sep 10 03:43:38 EDT 2010
> [INFO] Final Memory: 458M/1000M
> [INFO] ------------------------------------------------------------------------
>
> TESTSUITE RESULTS (Failures only)
> =================================
>
> Assembly: tomcat
> =================================
> See full test results and logs at http://people.apache.org/builds/geronimo/server/binaries/trunk/20100910/logs-0300-tomcat/
>
> Running TestSuite
> Tests run: 3, Failures: 3, Errors: 0, Skipped: 0, Time elapsed: 11.124 sec <<<
FAILURE!
> --
> Running TestSuite
> Tests run: 2, Failures: 1, Errors: 0, Skipped: 0, Time elapsed: 48.201 sec <<<
FAILURE!
>
> Assembly: jetty
> =================================
> See full test results and logs at http://people.apache.org/builds/geronimo/server/binaries/trunk/20100910/logs-0300-jetty/
>
> Running TestSuite
> Tests run: 3, Failures: 3, Errors: 0, Skipped: 0, Time elapsed: 11.26 sec <<<
FAILURE!
> Running TestSuite
> Tests run: 2, Failures: 1, Errors: 0, Skipped: 0, Time elapsed: 4.993 sec <<<
FAILURE!
> --
> Running TestSuite
> Tests run: 2, Failures: 2, Errors: 0, Skipped: 0, Time elapsed: 13.388 sec <<<
FAILURE!
> --
> Running TestSuite
> Tests run: 1, Failures: 1, Errors: 0, Skipped: 0, Time elapsed: 7.008 sec <<<
FAILURE!
>
> Samples: trunk
> =================================
> Log: http://people.apache.org/builds/geronimo/server/binaries/trunk/20100910/samples-0300.log
>
> Build status: OK
>
>

Mime
View raw message