geronimo-dev mailing list archives

Site index · List index
Message view « Date » · « Thread »
Top « Date » · « Thread »
From ga...@apache.org
Subject [BUILD] trunk: Failed for Revision: 993635
Date Wed, 08 Sep 2010 07:35:04 GMT
Geronimo Revision: 993635 built with tests included
 
See the full build-0300.log file at http://people.apache.org/builds/geronimo/server/binaries/trunk/20100908/build-0300.log
 
 
See the unit test reports at http://people.apache.org/builds/geronimo/server/binaries/trunk/20100908/unit-test-reports
 
Downloading: http://nexus.openqa.org/content/repositories/releases/org/apache/bval/bval-parent/0.2-incubating/bval-parent-0.2-incubating.pom
[INFO] Unable to find resource 'org.apache.bval:bval-parent:pom:0.2-incubating' in repository
openqa-releases (http://nexus.openqa.org/content/repositories/releases)
Downloading: http://maven.rtp.raleigh.ibm.com/nexus-proxy//org/apache/bval/bval-parent/0.2-incubating/bval-parent-0.2-incubating.pom
24K downloaded  (bval-parent-0.2-incubating.pom)
Downloading: file:///home/geronimo/.m2/jtidy.repository/org/apache/bval/org.apache.bval.bundle/0.2-incubating/org.apache.bval.bundle-0.2-incubating.jar
[INFO] Unable to find resource 'org.apache.bval:org.apache.bval.bundle:jar:0.2-incubating'
in repository local (file:///home/geronimo/.m2/jtidy.repository)
Downloading: http://oss.sonatype.org/content/repositories/jetty//org/apache/bval/org.apache.bval.bundle/0.2-incubating/org.apache.bval.bundle-0.2-incubating.jar
Downloading: file:///home/geronimo/.m2/jtidy.repository/commons-beanutils/commons-beanutils/1.8.3/commons-beanutils-1.8.3.jar
[INFO] Unable to find resource 'commons-beanutils:commons-beanutils:jar:1.8.3' in repository
local (file:///home/geronimo/.m2/jtidy.repository)
Downloading: http://oss.sonatype.org/content/repositories/jetty//commons-beanutils/commons-beanutils/1.8.3/commons-beanutils-1.8.3.jar
Downloading: file:///home/geronimo/.m2/jtidy.repository/org/apache/geronimo/specs/geronimo-validation_1.0_spec/1.1/geronimo-validation_1.0_spec-1.1.jar
[INFO] Unable to find resource 'org.apache.geronimo.specs:geronimo-validation_1.0_spec:jar:1.1'
in repository local (file:///home/geronimo/.m2/jtidy.repository)
Downloading: http://oss.sonatype.org/content/repositories/jetty//org/apache/geronimo/specs/geronimo-validation_1.0_spec/1.1/geronimo-validation_1.0_spec-1.1.jar
[INFO] Unable to find resource 'commons-beanutils:commons-beanutils:jar:1.8.3' in repository
jetty.oss.sonatype.org (http://oss.sonatype.org/content/repositories/jetty/)
Downloading: http://svn.apache.org/repos/asf/servicemix/m2-repo//commons-beanutils/commons-beanutils/1.8.3/commons-beanutils-1.8.3.jar
[INFO] Unable to find resource 'org.apache.geronimo.specs:geronimo-validation_1.0_spec:jar:1.1'
in repository jetty.oss.sonatype.org (http://oss.sonatype.org/content/repositories/jetty/)
Downloading: http://svn.apache.org/repos/asf/servicemix/m2-repo//org/apache/geronimo/specs/geronimo-validation_1.0_spec/1.1/geronimo-validation_1.0_spec-1.1.jar
[INFO] Unable to find resource 'org.apache.bval:org.apache.bval.bundle:jar:0.2-incubating'
in repository jetty.oss.sonatype.org (http://oss.sonatype.org/content/repositories/jetty/)
Downloading: http://svn.apache.org/repos/asf/servicemix/m2-repo//org/apache/bval/org.apache.bval.bundle/0.2-incubating/org.apache.bval.bundle-0.2-incubating.jar
[INFO] Unable to find resource 'commons-beanutils:commons-beanutils:jar:1.8.3' in repository
smx.svn (http://svn.apache.org/repos/asf/servicemix/m2-repo/)
Downloading: http://download.java.net/maven/1//commons-beanutils/jars/commons-beanutils-1.8.3.jar
[INFO] Unable to find resource 'org.apache.geronimo.specs:geronimo-validation_1.0_spec:jar:1.1'
in repository smx.svn (http://svn.apache.org/repos/asf/servicemix/m2-repo/)
Downloading: http://download.java.net/maven/1//org.apache.geronimo.specs/jars/geronimo-validation_1.0_spec-1.1.jar
[INFO] Unable to find resource 'org.apache.bval:org.apache.bval.bundle:jar:0.2-incubating'
in repository smx.svn (http://svn.apache.org/repos/asf/servicemix/m2-repo/)
Downloading: http://download.java.net/maven/1//org.apache.bval/jars/org.apache.bval.bundle-0.2-incubating.jar
[INFO] Unable to find resource 'commons-beanutils:commons-beanutils:jar:1.8.3' in repository
java.net (http://download.java.net/maven/1/)
Downloading: http://nexus.openqa.org/content/repositories/releases/commons-beanutils/commons-beanutils/1.8.3/commons-beanutils-1.8.3.jar
[INFO] Unable to find resource 'org.apache.geronimo.specs:geronimo-validation_1.0_spec:jar:1.1'
in repository java.net (http://download.java.net/maven/1/)
Downloading: http://nexus.openqa.org/content/repositories/releases/org/apache/geronimo/specs/geronimo-validation_1.0_spec/1.1/geronimo-validation_1.0_spec-1.1.jar
[INFO] Unable to find resource 'org.apache.bval:org.apache.bval.bundle:jar:0.2-incubating'
in repository java.net (http://download.java.net/maven/1/)
Downloading: http://nexus.openqa.org/content/repositories/releases/org/apache/bval/org.apache.bval.bundle/0.2-incubating/org.apache.bval.bundle-0.2-incubating.jar
[INFO] Unable to find resource 'commons-beanutils:commons-beanutils:jar:1.8.3' in repository
openqa-releases (http://nexus.openqa.org/content/repositories/releases)
Downloading: http://maven.rtp.raleigh.ibm.com/nexus-proxy//commons-beanutils/commons-beanutils/1.8.3/commons-beanutils-1.8.3.jar
[INFO] Unable to find resource 'org.apache.geronimo.specs:geronimo-validation_1.0_spec:jar:1.1'
in repository openqa-releases (http://nexus.openqa.org/content/repositories/releases)
Downloading: http://maven.rtp.raleigh.ibm.com/nexus-proxy//org/apache/geronimo/specs/geronimo-validation_1.0_spec/1.1/geronimo-validation_1.0_spec-1.1.jar
[INFO] Unable to find resource 'org.apache.bval:org.apache.bval.bundle:jar:0.2-incubating'
in repository openqa-releases (http://nexus.openqa.org/content/repositories/releases)
Downloading: http://maven.rtp.raleigh.ibm.com/nexus-proxy//org/apache/bval/org.apache.bval.bundle/0.2-incubating/org.apache.bval.bundle-0.2-incubating.jar
226K downloaded  (commons-beanutils-1.8.3.jar)
57K downloaded  (geronimo-validation_1.0_spec-1.1.jar)
273K downloaded  (org.apache.bval.bundle-0.2-incubating.jar)
[INFO] [enforcer:enforce {execution: default}]
[INFO] [remote-resources:process {execution: default}]
[INFO] [resources:resources {execution: default-resources}]
[INFO] Using 'UTF-8' encoding to copy filtered resources.
[INFO] skip non existing resourceDirectory /home/geronimo/geronimo/trunk/plugins/bval/geronimo-bval/src/main/resources
[INFO] skip non existing resourceDirectory /home/geronimo/geronimo/trunk/plugins/bval/geronimo-bval/src/main/filtered-resources
[INFO] Copying 3 resources
[INFO] [compiler:compile {execution: default-compile}]
[INFO] Compiling 3 source files to /home/geronimo/geronimo/trunk/plugins/bval/geronimo-bval/target/classes
[INFO] ------------------------------------------------------------------------
[ERROR] BUILD FAILURE
[INFO] ------------------------------------------------------------------------
[INFO] Compilation failure
/home/geronimo/geronimo/trunk/plugins/bval/geronimo-bval/src/main/java/org/apache/geronimo/bval/ValidatorFactoryGBean.java:[132,103]
inconvertible types
found   : javax.validation.Configuration<capture#283 of ?>
required: org.apache.bval.jsr303.ConfigurationImpl


[INFO] ------------------------------------------------------------------------
[INFO] Trace
org.apache.maven.BuildFailureException: Compilation failure
/home/geronimo/geronimo/trunk/plugins/bval/geronimo-bval/src/main/java/org/apache/geronimo/bval/ValidatorFactoryGBean.java:[132,103]
inconvertible types
found   : javax.validation.Configuration<capture#283 of ?>
required: org.apache.bval.jsr303.ConfigurationImpl


	at org.apache.maven.lifecycle.DefaultLifecycleExecutor.executeGoals(DefaultLifecycleExecutor.java:715)
	at org.apache.maven.lifecycle.DefaultLifecycleExecutor.executeGoalWithLifecycle(DefaultLifecycleExecutor.java:556)
	at org.apache.maven.lifecycle.DefaultLifecycleExecutor.executeGoal(DefaultLifecycleExecutor.java:535)
	at org.apache.maven.lifecycle.DefaultLifecycleExecutor.executeGoalAndHandleFailures(DefaultLifecycleExecutor.java:387)
	at org.apache.maven.lifecycle.DefaultLifecycleExecutor.executeTaskSegments(DefaultLifecycleExecutor.java:348)
	at org.apache.maven.lifecycle.DefaultLifecycleExecutor.execute(DefaultLifecycleExecutor.java:180)
	at org.apache.maven.DefaultMaven.doExecute(DefaultMaven.java:328)
	at org.apache.maven.DefaultMaven.execute(DefaultMaven.java:138)
	at org.apache.maven.cli.MavenCli.main(MavenCli.java:362)
	at org.apache.maven.cli.compat.CompatibleMain.main(CompatibleMain.java:60)
	at sun.reflect.NativeMethodAccessorImpl.invoke0(Native Method)
	at sun.reflect.NativeMethodAccessorImpl.invoke(NativeMethodAccessorImpl.java:39)
	at sun.reflect.DelegatingMethodAccessorImpl.invoke(DelegatingMethodAccessorImpl.java:25)
	at java.lang.reflect.Method.invoke(Method.java:597)
	at org.codehaus.classworlds.Launcher.launchEnhanced(Launcher.java:315)
	at org.codehaus.classworlds.Launcher.launch(Launcher.java:255)
	at org.codehaus.classworlds.Launcher.mainWithExitCode(Launcher.java:430)
	at org.codehaus.classworlds.Launcher.main(Launcher.java:375)
Caused by: org.apache.maven.plugin.CompilationFailureException: Compilation failure
/home/geronimo/geronimo/trunk/plugins/bval/geronimo-bval/src/main/java/org/apache/geronimo/bval/ValidatorFactoryGBean.java:[132,103]
inconvertible types
found   : javax.validation.Configuration<capture#283 of ?>
required: org.apache.bval.jsr303.ConfigurationImpl


	at org.apache.maven.plugin.AbstractCompilerMojo.execute(AbstractCompilerMojo.java:516)
	at org.apache.maven.plugin.CompilerMojo.execute(CompilerMojo.java:114)
	at org.apache.maven.plugin.DefaultPluginManager.executeMojo(DefaultPluginManager.java:490)
	at org.apache.maven.lifecycle.DefaultLifecycleExecutor.executeGoals(DefaultLifecycleExecutor.java:694)
	... 17 more
[INFO] ------------------------------------------------------------------------
[INFO] Total time: 19 minutes 40 seconds
[INFO] Finished at: Wed Sep 08 03:23:36 EDT 2010
[INFO] Final Memory: 337M/615M
[INFO] ------------------------------------------------------------------------

Mime
View raw message