geronimo-dev mailing list archives

Site index · List index
Message view « Date » · « Thread »
Top « Date » · « Thread »
From ga...@apache.org
Subject [BUILD] branches/2.2: Failed for Revision: 992585
Date Sat, 04 Sep 2010 15:08:05 GMT
Geronimo Revision: 992585 built with tests included
 
See the full build-0800.log file at http://people.apache.org/builds/geronimo/server/binaries/2.2/20100904/build-0800.log
 
Download the binaries from http://people.apache.org/builds/geronimo/server/binaries/2.2/20100904
[INFO] BUILD SUCCESSFUL
[INFO] ------------------------------------------------------------------------
[INFO] Total time: 37 minutes 48 seconds
[INFO] Finished at: Sat Sep 04 08:45:27 EDT 2010
[INFO] Final Memory: 312M/988M
[INFO] ------------------------------------------------------------------------
 
TESTSUITE RESULTS (Failures only)
=================================
 
Assembly: tomcat
=================================
See full test results and logs at http://people.apache.org/builds/geronimo/server/binaries/2.2/20100904/logs-0800-tomcat/
 
[INFO] Running TestSuite
[INFO] Tests run: 40, Failures: 34, Errors: 0, Skipped: 0, Time elapsed: 167.085 sec <<<
FAILURE!
[INFO] Running TestSuite
[INFO] Tests run: 12, Failures: 8, Errors: 0, Skipped: 0, Time elapsed: 62.707 sec <<<
FAILURE!
--
[INFO] Running TestSuite
[INFO] Tests run: 36, Failures: 1, Errors: 0, Skipped: 0, Time elapsed: 70.041 sec <<<
FAILURE!
 
[INFO] ------------------------------------------------------------------------
[INFO] [genesis:validate-configuration {execution: default}]
[INFO] snapshot org.apache.openejb:openejb-core:3.1.3-SNAPSHOT: checking for updates from
codehaus-snapshot
[INFO] snapshot org.apache.openejb:openejb-core:3.1.3-SNAPSHOT: checking for updates from
apache-m2-snapshot
[INFO] snapshot org.apache.openejb:openejb-core:3.1.3-SNAPSHOT: checking for updates from
java.net
[INFO] snapshot org.apache.openejb:container:3.1.3-SNAPSHOT: checking for updates from codehaus-snapshot
[INFO] snapshot org.apache.openejb:container:3.1.3-SNAPSHOT: checking for updates from apache-m2-snapshot
[INFO] snapshot org.apache.openejb:container:3.1.3-SNAPSHOT: checking for updates from java.net
[INFO] [enforcer:enforce {execution: default}]
[INFO] [remote-resources:process {execution: default}]
[INFO] [site:attach-descriptor {execution: default-attach-descriptor}]
[INFO] [:invoke {execution: default}]
[INFO] Invoking: /home/geronimo/geronimo/2.2/testsuite/cluster-testsuite/ejb-multicast/pom.xml
[INFO] + Error stacktraces are turned on.
[INFO] [INFO] Scanning for projects...
[INFO] [INFO] ------------------------------------------------------------------------
[INFO] [INFO] Building Geronimo TestSuite :: Cluster Testsuite :: EJB Multicast Tests
[INFO] [INFO]    task-segment: [install]
[INFO] [INFO] ------------------------------------------------------------------------
[INFO] [INFO] [genesis:validate-configuration {execution: default}]
[INFO] [INFO] [enforcer:enforce {execution: default}]
[INFO] [INFO] Setting property: classpath.resource.loader.class => 'org.codehaus.plexus.velocity.ContextClassLoaderResourceLoader'.
[INFO] [INFO] Setting property: velocimacro.messages.on => 'false'.
[INFO] [INFO] Setting property: resource.loader => 'classpath'.
[INFO] [INFO] Setting property: resource.manager.logwhenfound => 'false'.
[INFO] [INFO] [remote-resources:process {execution: default}]
[INFO] [INFO] [resources:resources {execution: default-resources}]
[INFO] [INFO] Using 'UTF-8' encoding to copy filtered resources.
[INFO] [INFO] Copying 1 resource
[INFO] [INFO] skip non existing resourceDirectory /home/geronimo/geronimo/2.2/testsuite/cluster-testsuite/ejb-multicast/src/main/filtered-resources
[INFO] [INFO] Copying 3 resources
[INFO] [INFO] [compiler:compile {execution: default-compile}]
[INFO] [INFO] No sources to compile
[INFO] [INFO] [resources:testResources {execution: default-testResources}]
[INFO] [INFO] Using 'UTF-8' encoding to copy filtered resources.
[INFO] [INFO] skip non existing resourceDirectory /home/geronimo/geronimo/2.2/testsuite/cluster-testsuite/ejb-multicast/src/test/resources
[INFO] [INFO] skip non existing resourceDirectory /home/geronimo/geronimo/2.2/testsuite/cluster-testsuite/ejb-multicast/src/test/filtered-resources
[INFO] [INFO] Copying 3 resources
[INFO] [INFO] [antrun:run {execution: create-server-instance}]
[INFO] [INFO] Executing tasks
[INFO] 
[INFO] linux:
[INFO]      [echo] #################################################################################
[INFO]      [echo] ##                                                                    
          
[INFO]      [echo] ## Unzipping: assembly                                                

[INFO]      [echo] ##                                                                    
          
[INFO]      [echo] #################################################################################
[INFO]     [mkdir] Created dir: /home/geronimo/geronimo/2.2/testsuite/cluster-testsuite/ejb-multicast/server1
[INFO]    [gunzip] Expanding /home/geronimo/.m2/repository/org/apache/geronimo/assemblies/geronimo-tomcat6-javaee5/2.2.2-SNAPSHOT/geronimo-tomcat6-javaee5-2.2.2-SNAPSHOT-bin.tar.gz
to /home/geronimo/geronimo/2.2/testsuite/cluster-testsuite/ejb-multicast/server1/geronimo-tomcat6-javaee5-2.2.2-SNAPSHOT-bin.tar
[INFO]     [untar] Expanding: /home/geronimo/geronimo/2.2/testsuite/cluster-testsuite/ejb-multicast/server1/geronimo-tomcat6-javaee5-2.2.2-SNAPSHOT-bin.tar
into /home/geronimo/geronimo/2.2/testsuite/cluster-testsuite/ejb-multicast/server1
[INFO]      [copy] Copying 4570 files to /home/geronimo/geronimo/2.2/testsuite/cluster-testsuite/ejb-multicast/server1
[INFO]      [copy] Copied 1851 empty directories to 17 empty directories under /home/geronimo/geronimo/2.2/testsuite/cluster-testsuite/ejb-multicast/server1
[INFO]    [delete] Deleting directory /home/geronimo/geronimo/2.2/testsuite/cluster-testsuite/ejb-multicast/server1/geronimo-tomcat6-javaee5-2.2.2-SNAPSHOT
[INFO]     [mkdir] Created dir: /home/geronimo/geronimo/2.2/testsuite/cluster-testsuite/ejb-multicast/server2
[INFO]      [copy] Copying 4571 files to /home/geronimo/geronimo/2.2/testsuite/cluster-testsuite/ejb-multicast/server2
[INFO]      [copy] Copied 1851 empty directories to 16 empty directories under /home/geronimo/geronimo/2.2/testsuite/cluster-testsuite/ejb-multicast/server2
[INFO] [INFO] Executed tasks
[INFO] [INFO] [geronimo:start-server {execution: start-server1}]
[INFO] [INFO] Using pre-installed assembly: /home/geronimo/geronimo/2.2/testsuite/cluster-testsuite/ejb-multicast/server1
[INFO] [INFO] Installation type is pre-existing; skipping installation
[INFO] [INFO] ------------------------------------------------------------------------
[INFO] [ERROR] FATAL ERROR
[INFO] [INFO] ------------------------------------------------------------------------
[INFO] [INFO] Requested factory com.ctc.wstx.stax.WstxInputFactory cannot be located.  Classloader
=org.codehaus.classworlds.RealmClassLoader@30ae41
[INFO] [INFO] ------------------------------------------------------------------------
[INFO] [INFO] Trace
[INFO] javax.xml.stream.FactoryConfigurationError: Requested factory com.ctc.wstx.stax.WstxInputFactory
cannot be located.  Classloader =org.codehaus.classworlds.RealmClassLoader@30ae41
[INFO] 	at javax.xml.stream.FactoryLocator.loadFactory(FactoryLocator.java:120)
[INFO] 	at javax.xml.stream.FactoryLocator.locate(FactoryLocator.java:109)
[INFO] 	at javax.xml.stream.FactoryLocator.locate(FactoryLocator.java:54)
[INFO] 	at javax.xml.stream.XMLInputFactory.newInstance(XMLInputFactory.java:41)
[INFO] 	at org.apache.geronimo.system.configuration.AttributesXmlUtil.<clinit>(AttributesXmlUtil.java:49)
[INFO] 	at org.apache.geronimo.mavenplugins.geronimo.server.ServerOverride.getOverrides(ServerOverride.java:40)
[INFO] 	at org.apache.geronimo.mavenplugins.geronimo.server.StartServerMojo.doExecute(StartServerMojo.java:206)
[INFO] 	at org.apache.geronimo.mavenplugins.geronimo.reporting.ReportingMojoSupport.execute(ReportingMojoSupport.java:99)
[INFO] 	at org.apache.maven.plugin.DefaultPluginManager.executeMojo(DefaultPluginManager.java:490)
[INFO] 	at org.apache.maven.lifecycle.DefaultLifecycleExecutor.executeGoals(DefaultLifecycleExecutor.java:694)
[INFO] 	at org.apache.maven.lifecycle.DefaultLifecycleExecutor.executeGoalWithLifecycle(DefaultLifecycleExecutor.java:556)
[INFO] 	at org.apache.maven.lifecycle.DefaultLifecycleExecutor.executeGoal(DefaultLifecycleExecutor.java:535)
[INFO] 	at org.apache.maven.lifecycle.DefaultLifecycleExecutor.executeGoalAndHandleFailures(DefaultLifecycleExecutor.java:387)
[INFO] 	at org.apache.maven.lifecycle.DefaultLifecycleExecutor.executeTaskSegments(DefaultLifecycleExecutor.java:348)
[INFO] 	at org.apache.maven.lifecycle.DefaultLifecycleExecutor.execute(DefaultLifecycleExecutor.java:180)
[INFO] 	at org.apache.maven.DefaultMaven.doExecute(DefaultMaven.java:328)
[INFO] 	at org.apache.maven.DefaultMaven.execute(DefaultMaven.java:138)
[INFO] 	at org.apache.maven.cli.MavenCli.main(MavenCli.java:362)
[INFO] 	at org.apache.maven.cli.compat.CompatibleMain.main(CompatibleMain.java:60)
[INFO] 	at sun.reflect.NativeMethodAccessorImpl.invoke0(Native Method)
[INFO] 	at sun.reflect.NativeMethodAccessorImpl.invoke(NativeMethodAccessorImpl.java:39)
[INFO] 	at sun.reflect.DelegatingMethodAccessorImpl.invoke(DelegatingMethodAccessorImpl.java:25)
[INFO] 	at java.lang.reflect.Method.invoke(Method.java:585)
[INFO] 	at org.codehaus.classworlds.Launcher.launchEnhanced(Launcher.java:315)
[INFO] 	at org.codehaus.classworlds.Launcher.launch(Launcher.java:255)
[INFO] 	at org.codehaus.classworlds.Launcher.mainWithExitCode(Launcher.java:430)
[INFO] 	at org.codehaus.classworlds.Launcher.main(Launcher.java:375)
[INFO] [INFO] ------------------------------------------------------------------------
[INFO] [INFO] Total time: 1 minute 27 seconds
[INFO] [INFO] Finished at: Sat Sep 04 09:57:25 EDT 2010
[INFO] [INFO] Final Memory: 49M/540M
[INFO] [INFO] ------------------------------------------------------------------------
[INFO] ------------------------------------------------------------------------
[ERROR] BUILD ERROR
 
Assembly: jetty
=================================
See full test results and logs at http://people.apache.org/builds/geronimo/server/binaries/2.2/20100904/logs-0800-jetty/
 
[INFO] Running TestSuite
[INFO] Tests run: 116, Failures: 3, Errors: 0, Skipped: 113, Time elapsed: 16.389 sec <<<
FAILURE!
[INFO] Running TestSuite
[INFO] Tests run: 12, Failures: 10, Errors: 0, Skipped: 0, Time elapsed: 59.596 sec <<<
FAILURE!
--
[INFO] Running TestSuite
[INFO] Tests run: 2, Failures: 2, Errors: 0, Skipped: 0, Time elapsed: 8.054 sec <<<
FAILURE!
--
[INFO] Running TestSuite
[INFO] Tests run: 36, Failures: 1, Errors: 0, Skipped: 0, Time elapsed: 17.523 sec <<<
FAILURE!
 
[INFO] Stopping Geronimo server...
[INFO] ------------------------------------------------------------------------
[INFO] Building Geronimo TestSuite :: Cluster Testsuite
[INFO]    task-segment: [install]
[INFO] ------------------------------------------------------------------------
[INFO] [genesis:validate-configuration {execution: default}]
[INFO] [enforcer:enforce {execution: default}]
[INFO] [remote-resources:process {execution: default}]
[INFO] [site:attach-descriptor {execution: default-attach-descriptor}]
[INFO] [:invoke {execution: default}]
[INFO] Invoking: /home/geronimo/geronimo/2.2/testsuite/cluster-testsuite/ejb-multicast/pom.xml
[INFO] + Error stacktraces are turned on.
[INFO] [INFO] Scanning for projects...
[INFO] [INFO] ------------------------------------------------------------------------
[INFO] [INFO] Building Geronimo TestSuite :: Cluster Testsuite :: EJB Multicast Tests
[INFO] [INFO]    task-segment: [install]
[INFO] [INFO] ------------------------------------------------------------------------
[INFO] [INFO] [genesis:validate-configuration {execution: default}]
[INFO] [INFO] [enforcer:enforce {execution: default}]
[INFO] [INFO] Setting property: classpath.resource.loader.class => 'org.codehaus.plexus.velocity.ContextClassLoaderResourceLoader'.
[INFO] [INFO] Setting property: velocimacro.messages.on => 'false'.
[INFO] [INFO] Setting property: resource.loader => 'classpath'.
[INFO] [INFO] Setting property: resource.manager.logwhenfound => 'false'.
[INFO] [INFO] [remote-resources:process {execution: default}]
[INFO] [INFO] [resources:resources {execution: default-resources}]
[INFO] [INFO] Using 'UTF-8' encoding to copy filtered resources.
[INFO] [INFO] Copying 1 resource
[INFO] [INFO] skip non existing resourceDirectory /home/geronimo/geronimo/2.2/testsuite/cluster-testsuite/ejb-multicast/src/main/filtered-resources
[INFO] [INFO] Copying 3 resources
[INFO] [INFO] [compiler:compile {execution: default-compile}]
[INFO] [INFO] No sources to compile
[INFO] [INFO] [resources:testResources {execution: default-testResources}]
[INFO] [INFO] Using 'UTF-8' encoding to copy filtered resources.
[INFO] [INFO] skip non existing resourceDirectory /home/geronimo/geronimo/2.2/testsuite/cluster-testsuite/ejb-multicast/src/test/resources
[INFO] [INFO] skip non existing resourceDirectory /home/geronimo/geronimo/2.2/testsuite/cluster-testsuite/ejb-multicast/src/test/filtered-resources
[INFO] [INFO] Copying 3 resources
[INFO] [INFO] [antrun:run {execution: create-server-instance}]
[INFO] [INFO] Executing tasks
[INFO] 
[INFO] linux:
[INFO]      [echo] #################################################################################
[INFO]      [echo] ##                                                                    
          
[INFO]      [echo] ## Unzipping: assembly                                                

[INFO]      [echo] ##                                                                    
          
[INFO]      [echo] #################################################################################
[INFO]    [delete] Deleting directory /home/geronimo/geronimo/2.2/testsuite/cluster-testsuite/ejb-multicast/server1
[INFO]     [mkdir] Created dir: /home/geronimo/geronimo/2.2/testsuite/cluster-testsuite/ejb-multicast/server1
[INFO]    [gunzip] Expanding /home/geronimo/.m2/repository/org/apache/geronimo/assemblies/geronimo-tomcat6-javaee5/2.2.2-SNAPSHOT/geronimo-tomcat6-javaee5-2.2.2-SNAPSHOT-bin.tar.gz
to /home/geronimo/geronimo/2.2/testsuite/cluster-testsuite/ejb-multicast/server1/geronimo-tomcat6-javaee5-2.2.2-SNAPSHOT-bin.tar
[INFO]     [untar] Expanding: /home/geronimo/geronimo/2.2/testsuite/cluster-testsuite/ejb-multicast/server1/geronimo-tomcat6-javaee5-2.2.2-SNAPSHOT-bin.tar
into /home/geronimo/geronimo/2.2/testsuite/cluster-testsuite/ejb-multicast/server1
[INFO]      [copy] Copying 4570 files to /home/geronimo/geronimo/2.2/testsuite/cluster-testsuite/ejb-multicast/server1
[INFO]      [copy] Copied 1851 empty directories to 17 empty directories under /home/geronimo/geronimo/2.2/testsuite/cluster-testsuite/ejb-multicast/server1
[INFO]    [delete] Deleting directory /home/geronimo/geronimo/2.2/testsuite/cluster-testsuite/ejb-multicast/server1/geronimo-tomcat6-javaee5-2.2.2-SNAPSHOT
[INFO]    [delete] Deleting directory /home/geronimo/geronimo/2.2/testsuite/cluster-testsuite/ejb-multicast/server2
[INFO]     [mkdir] Created dir: /home/geronimo/geronimo/2.2/testsuite/cluster-testsuite/ejb-multicast/server2
[INFO]      [copy] Copying 4571 files to /home/geronimo/geronimo/2.2/testsuite/cluster-testsuite/ejb-multicast/server2
[INFO]      [copy] Copied 1851 empty directories to 16 empty directories under /home/geronimo/geronimo/2.2/testsuite/cluster-testsuite/ejb-multicast/server2
[INFO] [INFO] Executed tasks
[INFO] [INFO] [geronimo:start-server {execution: start-server1}]
[INFO] [INFO] Using pre-installed assembly: /home/geronimo/geronimo/2.2/testsuite/cluster-testsuite/ejb-multicast/server1
[INFO] [INFO] Installation type is pre-existing; skipping installation
[INFO] [INFO] ------------------------------------------------------------------------
[INFO] [ERROR] FATAL ERROR
[INFO] [INFO] ------------------------------------------------------------------------
[INFO] [INFO] Requested factory com.ctc.wstx.stax.WstxInputFactory cannot be located.  Classloader
=org.codehaus.classworlds.RealmClassLoader@e183e9
[INFO] [INFO] ------------------------------------------------------------------------
[INFO] [INFO] Trace
[INFO] javax.xml.stream.FactoryConfigurationError: Requested factory com.ctc.wstx.stax.WstxInputFactory
cannot be located.  Classloader =org.codehaus.classworlds.RealmClassLoader@e183e9
[INFO] 	at javax.xml.stream.FactoryLocator.loadFactory(FactoryLocator.java:120)
[INFO] 	at javax.xml.stream.FactoryLocator.locate(FactoryLocator.java:109)
[INFO] 	at javax.xml.stream.FactoryLocator.locate(FactoryLocator.java:54)
[INFO] 	at javax.xml.stream.XMLInputFactory.newInstance(XMLInputFactory.java:41)
[INFO] 	at org.apache.geronimo.system.configuration.AttributesXmlUtil.<clinit>(AttributesXmlUtil.java:49)
[INFO] 	at org.apache.geronimo.mavenplugins.geronimo.server.ServerOverride.getOverrides(ServerOverride.java:40)
[INFO] 	at org.apache.geronimo.mavenplugins.geronimo.server.StartServerMojo.doExecute(StartServerMojo.java:206)
[INFO] 	at org.apache.geronimo.mavenplugins.geronimo.reporting.ReportingMojoSupport.execute(ReportingMojoSupport.java:99)
[INFO] 	at org.apache.maven.plugin.DefaultPluginManager.executeMojo(DefaultPluginManager.java:490)
[INFO] 	at org.apache.maven.lifecycle.DefaultLifecycleExecutor.executeGoals(DefaultLifecycleExecutor.java:694)
[INFO] 	at org.apache.maven.lifecycle.DefaultLifecycleExecutor.executeGoalWithLifecycle(DefaultLifecycleExecutor.java:556)
[INFO] 	at org.apache.maven.lifecycle.DefaultLifecycleExecutor.executeGoal(DefaultLifecycleExecutor.java:535)
[INFO] 	at org.apache.maven.lifecycle.DefaultLifecycleExecutor.executeGoalAndHandleFailures(DefaultLifecycleExecutor.java:387)
[INFO] 	at org.apache.maven.lifecycle.DefaultLifecycleExecutor.executeTaskSegments(DefaultLifecycleExecutor.java:348)
[INFO] 	at org.apache.maven.lifecycle.DefaultLifecycleExecutor.execute(DefaultLifecycleExecutor.java:180)
[INFO] 	at org.apache.maven.DefaultMaven.doExecute(DefaultMaven.java:328)
[INFO] 	at org.apache.maven.DefaultMaven.execute(DefaultMaven.java:138)
[INFO] 	at org.apache.maven.cli.MavenCli.main(MavenCli.java:362)
[INFO] 	at org.apache.maven.cli.compat.CompatibleMain.main(CompatibleMain.java:60)
[INFO] 	at sun.reflect.NativeMethodAccessorImpl.invoke0(Native Method)
[INFO] 	at sun.reflect.NativeMethodAccessorImpl.invoke(NativeMethodAccessorImpl.java:39)
[INFO] 	at sun.reflect.DelegatingMethodAccessorImpl.invoke(DelegatingMethodAccessorImpl.java:25)
[INFO] 	at java.lang.reflect.Method.invoke(Method.java:585)
[INFO] 	at org.codehaus.classworlds.Launcher.launchEnhanced(Launcher.java:315)
[INFO] 	at org.codehaus.classworlds.Launcher.launch(Launcher.java:255)
[INFO] 	at org.codehaus.classworlds.Launcher.mainWithExitCode(Launcher.java:430)
[INFO] 	at org.codehaus.classworlds.Launcher.main(Launcher.java:375)
[INFO] [INFO] ------------------------------------------------------------------------
[INFO] [INFO] Total time: 1 minute 29 seconds
[INFO] [INFO] Finished at: Sat Sep 04 11:07:15 EDT 2010
[INFO] [INFO] Final Memory: 55M/554M
[INFO] [INFO] ------------------------------------------------------------------------
[INFO] ------------------------------------------------------------------------
[ERROR] BUILD ERROR
 
Samples: branches/2.2
=================================
Log: http://people.apache.org/builds/geronimo/server/binaries/2.2/20100904/samples-0800.log
 
Build status: OK
 

Mime
View raw message