geronimo-dev mailing list archives

Site index · List index
Message view « Date » · « Thread »
Top « Date » · « Thread »
From ga...@apache.org
Subject [BUILD] branches/2.2: Failed for Revision: 989978
Date Fri, 27 Aug 2010 12:42:04 GMT
Geronimo Revision: 989978 built with tests included
 
See the full build-2000.log file at http://people.apache.org/builds/geronimo/server/binaries/2.2/20100826/build-2000.log
 
Download the binaries from http://people.apache.org/builds/geronimo/server/binaries/2.2/20100826
[INFO] BUILD SUCCESSFUL
[INFO] ------------------------------------------------------------------------
[INFO] Total time: 37 minutes 31 seconds
[INFO] Finished at: Thu Aug 26 20:43:09 EDT 2010
[INFO] Final Memory: 326M/913M
[INFO] ------------------------------------------------------------------------
 
TESTSUITE RESULTS (Failures only)
=================================
 
Assembly: tomcat
=================================
See full test results and logs at http://people.apache.org/builds/geronimo/server/binaries/2.2/20100826/logs-2000-tomcat/
 
[INFO] Running TestSuite
[INFO] Tests run: 40, Failures: 35, Errors: 0, Skipped: 0, Time elapsed: 165.984 sec <<<
FAILURE!
[INFO] Running TestSuite
[INFO] Tests run: 12, Failures: 7, Errors: 0, Skipped: 0, Time elapsed: 63.588 sec <<<
FAILURE!
--
[INFO] Running TestSuite
[INFO] Tests run: 36, Failures: 1, Errors: 0, Skipped: 0, Time elapsed: 69.333 sec <<<
FAILURE!
 
Assembly: jetty
=================================
See full test results and logs at http://people.apache.org/builds/geronimo/server/binaries/2.2/20100826/logs-2000-jetty/
 
[INFO] Running TestSuite
[INFO] Tests run: 40, Failures: 23, Errors: 0, Skipped: 0, Time elapsed: 213.102 sec <<<
FAILURE!
[INFO] Running TestSuite
[INFO] Tests run: 12, Failures: 10, Errors: 0, Skipped: 0, Time elapsed: 65.975 sec <<<
FAILURE!
 
[INFO] [INFO] Starting Xvfb...
[INFO] [INFO] Using display: :20
[INFO] [INFO] Using Xauthority file: /tmp/Xvfb1414528678591882973.Xauthority
[INFO] Deleting: /tmp/Xvfb1414528678591882973.Xauthority
[INFO] /usr/X11R6/bin/xauth:  creating new authority file /tmp/Xvfb1414528678591882973.Xauthority
[INFO] Launching Xvfb
[INFO] Waiting for Xvfb...
[INFO] [INFO] Redirecting output to: /home/geronimo/geronimo/2.2/testsuite/console-testsuite/advanced/target/selenium/xvfb.log
[INFO] Xvfb started
[INFO] [INFO] [resources:testResources]
[INFO] [INFO] Using 'UTF-8' encoding to copy filtered resources.
[INFO] [INFO] Copying 1 resource
[INFO] [INFO] skip non existing resourceDirectory /home/geronimo/geronimo/2.2/testsuite/console-testsuite/advanced/src/test/filtered-resources
[INFO] [INFO] Copying 3 resources
[INFO] [INFO] [compiler:testCompile]
[INFO] [INFO] Nothing to compile - all classes are up to date
[INFO] [INFO] [surefire:test]
[INFO] [INFO] Tests are skipped.
[INFO] [INFO] [jar:jar]
[INFO] [INFO] Building jar: /home/geronimo/geronimo/2.2/testsuite/console-testsuite/advanced/target/advanced-2.2.2-SNAPSHOT.jar
[INFO] [INFO] [selenium:start-server {execution: start}]
[INFO] Launching Selenium Server
[INFO] Waiting for Selenium Server...
[INFO] [INFO] Including display properties from: /home/geronimo/geronimo/2.2/testsuite/console-testsuite/advanced/target/selenium/display.properties
[INFO] [INFO] Redirecting output to: /home/geronimo/geronimo/2.2/testsuite/console-testsuite/advanced/target/selenium/server.log
[INFO] [INFO] User extensions: /home/geronimo/geronimo/2.2/testsuite/console-testsuite/advanced/target/selenium/user-extensions.js
[INFO] Selenium Server started
[INFO] [INFO] [failsafe:integration-test {execution: integration-test}]
[INFO] [INFO] Failsafe report directory: /home/geronimo/geronimo/2.2/testsuite/console-testsuite/advanced/target/failsafe-reports
[INFO] 
[INFO] -------------------------------------------------------
[INFO]  T E S T S
[INFO] -------------------------------------------------------
[INFO] Running TestSuite
[INFO] Tests run: 12, Failures: 10, Errors: 0, Skipped: 0, Time elapsed: 65.975 sec <<<
FAILURE!
[INFO] 
[INFO] Results :
[INFO] 
[INFO] Failed tests: 
[INFO]   testNewUser(org.apache.geronimo.testsuite.console.ConsoleRealmTest)
[INFO]   testRunSQL(org.apache.geronimo.testsuite.console.DBManagerTest)
[INFO]   testRunSQLDS(org.apache.geronimo.testsuite.console.DatabasePoolTest)
[INFO]   testNewDBPool(org.apache.geronimo.testsuite.console.DatabasePoolTest)
[INFO]   testEmptyDeployment(org.apache.geronimo.testsuite.console.DeploymentTest)
[INFO]   testNewJMSResource(org.apache.geronimo.testsuite.console.JMSResourcesTest)
[INFO]   testListPlugins(org.apache.geronimo.testsuite.console.PluginsTest)
[INFO]   testStartStopConnector(org.apache.geronimo.testsuite.console.WebServerTest)
[INFO]   testNewConnector(org.apache.geronimo.testsuite.console.WebServerTest)
[INFO]   testEditConnector(org.apache.geronimo.testsuite.console.WebServerTest)
[INFO] 
[INFO] Tests run: 12, Failures: 10, Errors: 0, Skipped: 0
[INFO] 
[INFO] [WARNING] File encoding has not been set, using platform encoding ANSI_X3.4-1968, i.e.
build is platform dependent!
[INFO] [INFO] [selenium:stop-server {execution: stop}]
[INFO] Stopping Selenium server...
[INFO] Stop request sent
[INFO] [INFO] [ianal:verify-legal-files {execution: default}]
[INFO] [WARNING] Skipping verification of legal files in artifacts:
[INFO] [WARNING]     org.apache.geronimo.testsuite:advanced:jar:2.2.2-SNAPSHOT
[INFO] [INFO] [failsafe:verify {execution: verify}]
[INFO] [INFO] Failsafe report directory: /home/geronimo/geronimo/2.2/testsuite/console-testsuite/advanced/target/failsafe-reports
[INFO] [WARNING] File encoding has not been set, using platform encoding ANSI_X3.4-1968, i.e.
build is platform dependent!
[INFO] [ERROR] There are test failures.
[INFO] 
[INFO] Please refer to /home/geronimo/geronimo/2.2/testsuite/console-testsuite/advanced/target/failsafe-reports
for the individual test results.
[INFO] [INFO] [install:install]
[INFO] [INFO] Installing /home/geronimo/geronimo/2.2/testsuite/console-testsuite/advanced/target/advanced-2.2.2-SNAPSHOT.jar
to /home/geronimo/.m2/repository/org/apache/geronimo/testsuite/advanced/2.2.2-SNAPSHOT/advanced-2.2.2-SNAPSHOT.jar
[INFO] [INFO] ------------------------------------------------------------------------
[INFO] [INFO] BUILD SUCCESSFUL
[INFO] [INFO] ------------------------------------------------------------------------
[INFO] [INFO] Total time: 1 minute 22 seconds
[INFO] [INFO] Finished at: Thu Aug 26 22:25:45 EDT 2010
[INFO] [INFO] Final Memory: 35M/565M
[INFO] [INFO] ------------------------------------------------------------------------
[INFO] [ianal:verify-legal-files {execution: default}]
[INFO] [install:install]
[INFO] Installing /home/geronimo/geronimo/2.2/testsuite/console-testsuite/pom.xml to /home/geronimo/.m2/repository/org/apache/geronimo/testsuite/console-testsuite/2.2.2-SNAPSHOT/console-testsuite-2.2.2-SNAPSHOT.pom
[INFO] [geronimo:stop-server {execution: stop}]
[INFO] Stopping Geronimo server...
[INFO] ------------------------------------------------------------------------
[INFO] Building Geronimo TestSuite :: CORBA TestSuite
[INFO]    task-segment: [install]
[INFO] ------------------------------------------------------------------------
[INFO] [genesis:validate-configuration {execution: default}]
[INFO] [enforcer:enforce {execution: default}]
[INFO] [remote-resources:process {execution: default}]
[INFO] [site:attach-descriptor]
[INFO] [install:install {execution: install-ahead}]
[INFO] Installing /home/geronimo/geronimo/2.2/testsuite/corba-testsuite/pom.xml to /home/geronimo/.m2/repository/org/apache/geronimo/testsuite/corba-testsuite/2.2.2-SNAPSHOT/corba-testsuite-2.2.2-SNAPSHOT.pom
[INFO] [geronimo:start-server {execution: start}]
[INFO] Using assembly configuration: jetty
[INFO] Using assembly artifact: org.apache.geronimo.assemblies:geronimo-jetty7-javaee5:zip:bin:2.2.2-SNAPSHOT:provided
[INFO] Using geronimoHome: /home/geronimo/geronimo/2.2/testsuite/corba-testsuite/target/geronimo-jetty7-javaee5-2.2.2-SNAPSHOT
[INFO] Installing assembly...
[INFO] Expanding: /home/geronimo/.m2/repository/org/apache/geronimo/assemblies/geronimo-jetty7-javaee5/2.2.2-SNAPSHOT/geronimo-jetty7-javaee5-2.2.2-SNAPSHOT-bin.zip
into /home/geronimo/geronimo/2.2/testsuite/corba-testsuite/target
[INFO] Starting Geronimo server...
[INFO] Selected option set: default
[INFO] Redirecting output to: /home/geronimo/geronimo/2.2/testsuite/corba-testsuite/target/geronimo-logs/org.apache.geronimo.mavenplugins.geronimo.server.StartServerMojo.log
[INFO] Waiting for Geronimo server...
[INFO] ------------------------------------------------------------------------
[ERROR] BUILD ERROR
 
Samples: branches/2.2
=================================
Log: http://people.apache.org/builds/geronimo/server/binaries/2.2/20100826/samples-2000.log
 
Build status: FAILED
 

Mime
View raw message