geronimo-dev mailing list archives

Site index · List index
Message view « Date » · « Thread »
Top « Date » · « Thread »
From ga...@apache.org
Subject [BUILD] trunk: Failed for Revision: 989664
Date Thu, 26 Aug 2010 15:14:50 GMT
Geronimo Revision: 989664 built with tests included
 
See the full build-0900.log file at http://people.apache.org/builds/geronimo/server/binaries/trunk/20100826/build-0900.log
 
Download the binaries from http://people.apache.org/builds/geronimo/server/binaries/trunk/20100826
[INFO] BUILD SUCCESSFUL
[INFO] ------------------------------------------------------------------------
[INFO] Total time: 46 minutes 8 seconds
[INFO] Finished at: Thu Aug 26 10:01:39 EDT 2010
[INFO] Final Memory: 470M/1013M
[INFO] ------------------------------------------------------------------------
 
TESTSUITE RESULTS (Failures only)
=================================
 
Assembly: tomcat
=================================
See full test results and logs at http://people.apache.org/builds/geronimo/server/binaries/trunk/20100826/logs-0900-tomcat/
 
 
[INFO] [enforcer:enforce {execution: default}]
[INFO] [remote-resources:process {execution: default}]
[INFO] [site:attach-descriptor {execution: default-attach-descriptor}]
[INFO] [ianal:verify-legal-files {execution: default}]
[INFO] [install:install {execution: default-install}]
[INFO] Installing /home/geronimo/geronimo/trunk/testsuite/commands-testsuite/pom.xml to /home/geronimo/.m2/repository/org/apache/geronimo/testsuite/commands-testsuite/3.0-SNAPSHOT/commands-testsuite-3.0-SNAPSHOT.pom
[INFO] ------------------------------------------------------------------------
[INFO] Building Geronimo TestSuite :: Commands Testsuite :: Deployer
[INFO]    task-segment: [install]
[INFO] ------------------------------------------------------------------------
Downloading: http://maven.rtp.raleigh.ibm.com/nexus-proxy//org/apache/maven/plugins/maven-failsafe-plugin/2.5/maven-failsafe-plugin-2.5.pom
9K downloaded  (maven-failsafe-plugin-2.5.pom)
Downloading: http://maven.rtp.raleigh.ibm.com/nexus-proxy//org/apache/maven/surefire/surefire/2.5/surefire-2.5.pom
6K downloaded  (surefire-2.5.pom)
Downloading: http://maven.rtp.raleigh.ibm.com/nexus-proxy//org/apache/maven/maven-parent/15/maven-parent-15.pom
23K downloaded  (maven-parent-15.pom)
Downloading: http://maven.rtp.raleigh.ibm.com/nexus-proxy//org/apache/maven/plugins/maven-failsafe-plugin/2.5/maven-failsafe-plugin-2.5.jar
46K downloaded  (maven-failsafe-plugin-2.5.jar)
[INFO] [genesis:validate-configuration {execution: default}]
[INFO] [geronimo-property:set-property {execution: set-property}]
[INFO] [enforcer:enforce {execution: default}]
[INFO] [remote-resources:process {execution: default}]
[INFO] [resources:resources {execution: default-resources}]
[INFO] Using 'UTF-8' encoding to copy filtered resources.
[INFO] skip non existing resourceDirectory /home/geronimo/geronimo/trunk/testsuite/commands-testsuite/deploy/src/main/resources
[INFO] skip non existing resourceDirectory /home/geronimo/geronimo/trunk/testsuite/commands-testsuite/deploy/src/main/filtered-resources
[INFO] Copying 3 resources
[INFO] [compiler:compile {execution: default-compile}]
[INFO] No sources to compile
[INFO] [resources:testResources {execution: default-testResources}]
[INFO] Using 'UTF-8' encoding to copy filtered resources.
[INFO] Copying 1 resource
[INFO] skip non existing resourceDirectory /home/geronimo/geronimo/trunk/testsuite/commands-testsuite/deploy/src/test/filtered-resources
[INFO] Copying 3 resources
[INFO] [compiler:testCompile {execution: default-testCompile}]
[INFO] Compiling 2 source files to /home/geronimo/geronimo/trunk/testsuite/commands-testsuite/deploy/target/test-classes
[INFO] [surefire:test {execution: default-test}]
[INFO] Tests are skipped.
[INFO] [jar:jar {execution: default-jar}]
[INFO] Building jar: /home/geronimo/geronimo/trunk/testsuite/commands-testsuite/deploy/target/deploy-3.0-SNAPSHOT.jar
[org.codehaus.mojo.pluginsupport.logging.Logging] : Initialized
[INFO] [geronimo:start-server {execution: start-geronimo}]
[INFO] Using assembly configuration: tomcat
[INFO] snapshot org.apache.geronimo.assemblies:geronimo-tomcat7-javaee6:3.0-SNAPSHOT: checking
for updates from codehaus.snapshots
[INFO] snapshot org.apache.geronimo.assemblies:geronimo-tomcat7-javaee6:3.0-SNAPSHOT: checking
for updates from apache.snapshots
[INFO] Using assembly artifact: org.apache.geronimo.assemblies:geronimo-tomcat7-javaee6:zip:bin:3.0-SNAPSHOT:provided
[INFO] Using geronimoHome: /home/geronimo/geronimo/trunk/testsuite/commands-testsuite/deploy/target/geronimo-tomcat7-javaee6-3.0-SNAPSHOT
[INFO] Installing assembly...
[INFO] Expanding: /home/geronimo/.m2/repository/org/apache/geronimo/assemblies/geronimo-tomcat7-javaee6/3.0-SNAPSHOT/geronimo-tomcat7-javaee6-3.0-SNAPSHOT-bin.zip
into /home/geronimo/geronimo/trunk/testsuite/commands-testsuite/deploy/target
[INFO] Starting Geronimo server...
[INFO] Selected option set: default
[INFO] Redirecting output to: /home/geronimo/geronimo/trunk/testsuite/commands-testsuite/deploy/target/geronimo-logs/org.apache.geronimo.mavenplugins.geronimo.server.StartServerMojo.log
[INFO] Waiting for Geronimo server...
[org.apache.geronimo.mavenplugins.geronimo.ServerProxy] : Initialized with URL: service:jmx:rmi://localhost/jndi/rmi://localhost:1099/JMXConnector,
environment: {jmx.remote.credentials=[Ljava.lang.String;@e015ef}
[org.apache.geronimo.mavenplugins.geronimo.ServerProxy] : Connecting to: service:jmx:rmi://localhost/jndi/rmi://localhost:1099/JMXConnector
[org.apache.geronimo.mavenplugins.geronimo.ServerProxy] : Connection failure; ignoring: java.io.IOException:
Failed to retrieve RMIServer stub: javax.naming.ServiceUnavailableException [Root exception
is java.rmi.ConnectException: Connection refused to host: localhost; nested exception is:

	java.net.ConnectException: Connection refused]
[org.apache.geronimo.mavenplugins.geronimo.ServerProxy] : Connecting to: service:jmx:rmi://localhost/jndi/rmi://localhost:1099/JMXConnector
[org.apache.geronimo.mavenplugins.geronimo.ServerProxy] : Connection failure; ignoring: java.io.IOException:
Failed to retrieve RMIServer stub: javax.naming.ServiceUnavailableException [Root exception
is java.rmi.ConnectException: Connection refused to host: localhost; nested exception is:

	java.net.ConnectException: Connection refused]
[org.apache.geronimo.mavenplugins.geronimo.ServerProxy] : Connecting to: service:jmx:rmi://localhost/jndi/rmi://localhost:1099/JMXConnector
[org.apache.geronimo.mavenplugins.geronimo.ServerProxy] : Connection failure; ignoring: java.io.IOException:
Failed to retrieve RMIServer stub: javax.naming.ServiceUnavailableException [Root exception
is java.rmi.ConnectException: Connection refused to host: localhost; nested exception is:

	java.net.ConnectException: Connection refused]
[org.apache.geronimo.mavenplugins.geronimo.ServerProxy] : Connecting to: service:jmx:rmi://localhost/jndi/rmi://localhost:1099/JMXConnector
[org.apache.geronimo.mavenplugins.geronimo.ServerProxy] : Connected
[INFO] Geronimo server started in 0:00:46.958
Downloading: http://maven.rtp.raleigh.ibm.com/nexus-proxy//org/apache/maven/surefire/surefire-booter/2.5/surefire-booter-2.5.pom
1K downloaded  (surefire-booter-2.5.pom)
Downloading: file:///home/geronimo/.m2/jtidy.repository/org/apache/maven/surefire/surefire-api/2.5/surefire-api-2.5.pom
[INFO] Unable to find resource 'org.apache.maven.surefire:surefire-api:pom:2.5' in repository
local (file:///home/geronimo/.m2/jtidy.repository)
Downloading: http://maven.rtp.raleigh.ibm.com/nexus-proxy//org/apache/maven/surefire/surefire-api/2.5/surefire-api-2.5.pom
2K downloaded  (surefire-api-2.5.pom)
Downloading: http://maven.rtp.raleigh.ibm.com/nexus-proxy//org/codehaus/plexus/plexus-utils/1.5.9/plexus-utils-1.5.9.pom
5K downloaded  (plexus-utils-1.5.9.pom)
Downloading: http://maven.rtp.raleigh.ibm.com/nexus-proxy//org/apache/maven/maven-toolchain/2.0.9/maven-toolchain-2.0.9.pom
3K downloaded  (maven-toolchain-2.0.9.pom)
Downloading: http://maven.rtp.raleigh.ibm.com/nexus-proxy//org/codehaus/plexus/plexus-utils/1.5.9/plexus-utils-1.5.9.jar
Downloading: http://maven.rtp.raleigh.ibm.com/nexus-proxy//org/apache/maven/surefire/surefire-booter/2.5/surefire-booter-2.5.jar
262K downloaded  (plexus-utils-1.5.9.jar)
313K downloaded  (surefire-booter-2.5.jar)
Downloading: file:///home/geronimo/.m2/jtidy.repository/org/apache/maven/surefire/surefire-api/2.5/surefire-api-2.5.jar
[INFO] Unable to find resource 'org.apache.maven.surefire:surefire-api:jar:2.5' in repository
local (file:///home/geronimo/.m2/jtidy.repository)
Downloading: http://maven.rtp.raleigh.ibm.com/nexus-proxy//org/apache/maven/surefire/surefire-api/2.5/surefire-api-2.5.jar
557K downloaded  (surefire-api-2.5.jar)
[WARNING] DEPRECATED [systemProperties]: Use systemPropertyVariables instead.
[INFO] [failsafe:integration-test {execution: integration-test}]
Downloading: http://maven.rtp.raleigh.ibm.com/nexus-proxy//org/apache/maven/surefire/surefire-testng/2.5/surefire-testng-2.5.pom
2K downloaded  (surefire-testng-2.5.pom)
Downloading: http://maven.rtp.raleigh.ibm.com/nexus-proxy//org/apache/maven/surefire/surefire-providers/2.5/surefire-providers-2.5.pom
1K downloaded  (surefire-providers-2.5.pom)
Downloading: http://maven.rtp.raleigh.ibm.com/nexus-proxy//org/apache/maven/surefire/surefire-testng/2.5/surefire-testng-2.5.jar
26K downloaded  (surefire-testng-2.5.jar)
[INFO] Failsafe report directory: /home/geronimo/geronimo/trunk/testsuite/commands-testsuite/deploy/target/failsafe-reports

-------------------------------------------------------
 T E S T S
-------------------------------------------------------
Running TestSuite
killed.
[INFO] ------------------------------------------------------------------------
[ERROR] BUILD ERROR
 
Assembly: jetty
=================================
See full test results and logs at http://people.apache.org/builds/geronimo/server/binaries/trunk/20100826/logs-0900-jetty/
 
Running TestSuite
Tests run: 3, Failures: 3, Errors: 0, Skipped: 0, Time elapsed: 11.312 sec <<< FAILURE!
Running TestSuite
Tests run: 2, Failures: 1, Errors: 0, Skipped: 0, Time elapsed: 5.077 sec <<< FAILURE!
 
Samples: trunk
=================================
Log: http://people.apache.org/builds/geronimo/server/binaries/trunk/20100826/samples-0900.log
 
Build status: OK
 

Mime
View raw message