geronimo-dev mailing list archives

Site index · List index
Message view « Date » · « Thread »
Top « Date » · « Thread »
From ga...@apache.org
Subject [BUILD] trunk: Failed for Revision: 987964
Date Mon, 23 Aug 2010 01:33:28 GMT
Geronimo Revision: 987964 built with tests included
 
See the full build-2100.log file at http://people.apache.org/builds/geronimo/server/binaries/trunk/20100822/build-2100.log
 
 
See the unit test reports at http://people.apache.org/builds/geronimo/server/binaries/trunk/20100822/unit-test-reports
 
Downloading: http://nexus.openqa.org/content/repositories/releases/org/apache/commons/commons-math/2.1/commons-math-2.1.jar
[INFO] Unable to find resource 'org.apache.geronimo.specs:geronimo-interceptor_1.1_spec:jar:1.0'
in repository java.net (http://download.java.net/maven/1/)
Downloading: http://nexus.openqa.org/content/repositories/releases/org/apache/geronimo/specs/geronimo-interceptor_1.1_spec/1.0/geronimo-interceptor_1.1_spec-1.0.jar
[INFO] Unable to find resource 'org.codehaus.swizzle:swizzle-stream:jar:1.0.2' in repository
openqa-releases (http://nexus.openqa.org/content/repositories/releases)
Downloading: http://people.apache.org/repo/m2-incubating-repository/org/codehaus/swizzle/swizzle-stream/1.0.2/swizzle-stream-1.0.2.jar
[INFO] Unable to find resource 'org.apache.commons:commons-math:jar:2.1' in repository openqa-releases
(http://nexus.openqa.org/content/repositories/releases)
Downloading: http://people.apache.org/repo/m2-incubating-repository/org/apache/commons/commons-math/2.1/commons-math-2.1.jar
[INFO] Unable to find resource 'org.apache.geronimo.specs:geronimo-interceptor_1.1_spec:jar:1.0'
in repository openqa-releases (http://nexus.openqa.org/content/repositories/releases)
Downloading: http://maven.rtp.raleigh.ibm.com/nexus-proxy//org/apache/geronimo/specs/geronimo-interceptor_1.1_spec/1.0/geronimo-interceptor_1.1_spec-1.0.jar
10K downloaded  (geronimo-interceptor_1.1_spec-1.0.jar)
[INFO] Unable to find resource 'org.codehaus.swizzle:swizzle-stream:jar:1.0.2' in repository
apache-incubating-repository (http://people.apache.org/repo/m2-incubating-repository)
[INFO] Unable to find resource 'org.apache.commons:commons-math:jar:2.1' in repository apache-incubating-repository
(http://people.apache.org/repo/m2-incubating-repository)
Downloading: http://tomcat.apache.org/dev/dist/m2-repository/org/codehaus/swizzle/swizzle-stream/1.0.2/swizzle-stream-1.0.2.jar
Downloading: http://tomcat.apache.org/dev/dist/m2-repository/org/apache/commons/commons-math/2.1/commons-math-2.1.jar
1700K downloaded  (openejb-core-3.2-20100823.001616-33.jar)
[INFO] Unable to find resource 'org.codehaus.swizzle:swizzle-stream:jar:1.0.2' in repository
tomcat-private-repository (http://tomcat.apache.org/dev/dist/m2-repository)
Downloading: http://svn.apache.org/repos/asf/openejb/repo//org/codehaus/swizzle/swizzle-stream/1.0.2/swizzle-stream-1.0.2.jar
[INFO] Unable to find resource 'org.apache.commons:commons-math:jar:2.1' in repository tomcat-private-repository
(http://tomcat.apache.org/dev/dist/m2-repository)
Downloading: http://svn.apache.org/repos/asf/openejb/repo//org/apache/commons/commons-math/2.1/commons-math-2.1.jar
Downloading: http://repository.apache.org/snapshots//org/apache/openejb/openejb-api/3.2-SNAPSHOT/openejb-api-3.2-20100823.001616-38.jar
[INFO] Unable to find resource 'org.codehaus.swizzle:swizzle-stream:jar:1.0.2' in repository
openejb-3rdparty-builds (http://svn.apache.org/repos/asf/openejb/repo/)
Downloading: http://maven.rtp.raleigh.ibm.com/nexus-proxy//org/codehaus/swizzle/swizzle-stream/1.0.2/swizzle-stream-1.0.2.jar
[INFO] Unable to find resource 'org.apache.commons:commons-math:jar:2.1' in repository openejb-3rdparty-builds
(http://svn.apache.org/repos/asf/openejb/repo/)
Downloading: http://maven.rtp.raleigh.ibm.com/nexus-proxy//org/apache/commons/commons-math/2.1/commons-math-2.1.jar
42K downloaded  (swizzle-stream-1.0.2.jar)
8K downloaded  (openejb-api-3.2-20100823.001616-38.jar)
812K downloaded  (commons-math-2.1.jar)
Downloading: http://repository.apache.org/snapshots/org/apache/openejb/openejb-loader/3.2-SNAPSHOT/openejb-loader-3.2-20100823.001616-38.jar
43K downloaded  (openejb-loader-3.2-20100823.001616-38.jar)
Downloading: http://repository.apache.org/snapshots/org/apache/openejb/openejb-javaagent/3.2-SNAPSHOT/openejb-javaagent-3.2-20100823.001616-38.jar
12K downloaded  (openejb-javaagent-3.2-20100823.001616-38.jar)
Downloading: http://repository.apache.org/snapshots/org/apache/openejb/openejb-ejbd/3.2-SNAPSHOT/openejb-ejbd-3.2-20100823.001616-32.jar
58K downloaded  (openejb-ejbd-3.2-20100823.001616-32.jar)
Downloading: http://repository.apache.org/snapshots/org/apache/openejb/openejb-server/3.2-SNAPSHOT/openejb-server-3.2-20100823.001616-33.jar
85K downloaded  (openejb-server-3.2-20100823.001616-33.jar)
Downloading: http://repository.apache.org/snapshots/org/apache/openejb/openejb-client/3.2-SNAPSHOT/openejb-client-3.2-20100823.001616-33.jar
212K downloaded  (openejb-client-3.2-20100823.001616-33.jar)
Downloading: http://repository.apache.org/snapshots/org/apache/openejb/openejb-multicast/3.2-SNAPSHOT/openejb-multicast-3.2-20100823.001616-33.jar
50K downloaded  (openejb-multicast-3.2-20100823.001616-33.jar)
[INFO] [enforcer:enforce {execution: default}]
[INFO] [remote-resources:process {execution: default}]
[INFO] [resources:resources {execution: default-resources}]
[INFO] Using 'UTF-8' encoding to copy filtered resources.
[INFO] Copying 1 resource
[INFO] skip non existing resourceDirectory /home/geronimo/geronimo/trunk/plugins/openejb/geronimo-openejb/src/main/filtered-resources
[INFO] Copying 3 resources
[INFO] [compiler:compile {execution: default-compile}]
[INFO] Compiling 34 source files to /home/geronimo/geronimo/trunk/plugins/openejb/geronimo-openejb/target/classes
[INFO] ------------------------------------------------------------------------
[ERROR] BUILD FAILURE
[INFO] ------------------------------------------------------------------------
[INFO] Compilation failure

/home/geronimo/geronimo/trunk/plugins/openejb/geronimo-openejb/src/main/java/org/apache/geronimo/openejb/GeronimoEjbInfo.java:[47,15]
cannot find symbol
symbol  : variable jarPath
location: class org.apache.openejb.assembler.classic.AppInfo

/home/geronimo/geronimo/trunk/plugins/openejb/geronimo-openejb/src/main/java/org/apache/geronimo/openejb/GeronimoEjbInfo.java:[47,36]
cannot find symbol
symbol  : variable jarPath
location: class org.apache.openejb.assembler.classic.EjbJarInfo

/home/geronimo/geronimo/trunk/plugins/openejb/geronimo-openejb/src/main/java/org/apache/geronimo/openejb/GeronimoSecurityService.java:[53,45]
[deprecation] login(java.lang.String,javax.security.auth.callback.CallbackHandler) in org.apache.geronimo.security.ContextManager
has been deprecated

/home/geronimo/geronimo/trunk/plugins/openejb/geronimo-openejb/src/main/java/org/apache/geronimo/openejb/OpenEjbSystemGBean.java:[438,44]
cannot find symbol
symbol  : variable jarPath
location: class org.apache.openejb.assembler.classic.AppInfo


[INFO] ------------------------------------------------------------------------
[INFO] Trace
org.apache.maven.BuildFailureException: Compilation failure
	at org.apache.maven.lifecycle.DefaultLifecycleExecutor.executeGoals(DefaultLifecycleExecutor.java:715)
	at org.apache.maven.lifecycle.DefaultLifecycleExecutor.executeGoalWithLifecycle(DefaultLifecycleExecutor.java:556)
	at org.apache.maven.lifecycle.DefaultLifecycleExecutor.executeGoal(DefaultLifecycleExecutor.java:535)
	at org.apache.maven.lifecycle.DefaultLifecycleExecutor.executeGoalAndHandleFailures(DefaultLifecycleExecutor.java:387)
	at org.apache.maven.lifecycle.DefaultLifecycleExecutor.executeTaskSegments(DefaultLifecycleExecutor.java:348)
	at org.apache.maven.lifecycle.DefaultLifecycleExecutor.execute(DefaultLifecycleExecutor.java:180)
	at org.apache.maven.DefaultMaven.doExecute(DefaultMaven.java:328)
	at org.apache.maven.DefaultMaven.execute(DefaultMaven.java:138)
	at org.apache.maven.cli.MavenCli.main(MavenCli.java:362)
	at org.apache.maven.cli.compat.CompatibleMain.main(CompatibleMain.java:60)
	at sun.reflect.NativeMethodAccessorImpl.invoke0(Native Method)
	at sun.reflect.NativeMethodAccessorImpl.invoke(NativeMethodAccessorImpl.java:39)
	at sun.reflect.DelegatingMethodAccessorImpl.invoke(DelegatingMethodAccessorImpl.java:25)
	at java.lang.reflect.Method.invoke(Method.java:597)
	at org.codehaus.classworlds.Launcher.launchEnhanced(Launcher.java:315)
	at org.codehaus.classworlds.Launcher.launch(Launcher.java:255)
	at org.codehaus.classworlds.Launcher.mainWithExitCode(Launcher.java:430)
	at org.codehaus.classworlds.Launcher.main(Launcher.java:375)
Caused by: org.apache.maven.plugin.CompilationFailureException: Compilation failure
	at org.apache.maven.plugin.AbstractCompilerMojo.execute(AbstractCompilerMojo.java:516)
	at org.apache.maven.plugin.CompilerMojo.execute(CompilerMojo.java:114)
	at org.apache.maven.plugin.DefaultPluginManager.executeMojo(DefaultPluginManager.java:490)
	at org.apache.maven.lifecycle.DefaultLifecycleExecutor.executeGoals(DefaultLifecycleExecutor.java:694)
	... 17 more
[INFO] ------------------------------------------------------------------------
[INFO] Total time: 17 minutes 45 seconds
[INFO] Finished at: Sun Aug 22 21:22:51 EDT 2010
[INFO] Final Memory: 347M/623M
[INFO] ------------------------------------------------------------------------

Mime
View raw message