geronimo-dev mailing list archives

Site index · List index
Message view « Date » · « Thread »
Top « Date » · « Thread »
From ga...@apache.org
Subject [BUILD] branches/2.2: Failed for Revision: 987464
Date Sun, 22 Aug 2010 16:50:14 GMT
Geronimo Revision: 987464 built with tests included
 
See the full build-0800.log file at http://people.apache.org/builds/geronimo/server/binaries/2.2/20100820/build-0800.log
 
Download the binaries from http://people.apache.org/builds/geronimo/server/binaries/2.2/20100820
[INFO] BUILD SUCCESSFUL
[INFO] ------------------------------------------------------------------------
[INFO] Total time: 43 minutes 14 seconds
[INFO] Finished at: Fri Aug 20 08:50:37 EDT 2010
[INFO] Final Memory: 344M/1013M
[INFO] ------------------------------------------------------------------------
 
TESTSUITE RESULTS (Failures only)
=================================
 
Assembly: tomcat
=================================
See full test results and logs at http://people.apache.org/builds/geronimo/server/binaries/2.2/20100820/logs-0800-tomcat/
 
[INFO] Running TestSuite
[INFO] Tests run: 40, Failures: 32, Errors: 0, Skipped: 0, Time elapsed: 179.182 sec <<<
FAILURE!
[INFO] Running TestSuite
[INFO] Tests run: 12, Failures: 11, Errors: 0, Skipped: 0, Time elapsed: 51.779 sec <<<
FAILURE!
--
[INFO] Running TestSuite
[INFO] Tests run: 36, Failures: 1, Errors: 0, Skipped: 0, Time elapsed: 69.236 sec <<<
FAILURE!
 
Assembly: jetty
=================================
See full test results and logs at http://people.apache.org/builds/geronimo/server/binaries/2.2/20100820/logs-0800-jetty/
 
 
[INFO] Scanning for projects...
[INFO] Reactor build order: 
[INFO]   Geronimo TestSuite
[INFO]   Geronimo TestSuite :: Commands TestSuite
[INFO]   Geronimo TestSuite :: Concurrent TestSuite
[INFO]   Geronimo TestSuite :: Console Testsuite
[INFO]   Geronimo TestSuite :: CORBA TestSuite
[INFO]   Geronimo TestSuite :: Deployment Testsuite
[INFO]   Geronimo TestSuite :: Enterprise Testsuite
[INFO]   Geronimo TestSuite :: Security Testsuite
[INFO]   Geronimo TestSuite :: Web-tier Testsuite
[INFO]   Geronimo TestSuite :: WebServices TestSuite
[INFO] ------------------------------------------------------------------------
[INFO] Building Geronimo TestSuite
[INFO]    task-segment: [install]
[INFO] ------------------------------------------------------------------------
[INFO] [genesis:validate-configuration {execution: default}]
[INFO] [enforcer:enforce {execution: default}]
[INFO] Setting property: classpath.resource.loader.class => 'org.codehaus.plexus.velocity.ContextClassLoaderResourceLoader'.
[INFO] Setting property: velocimacro.messages.on => 'false'.
[INFO] Setting property: resource.loader => 'classpath'.
[INFO] Setting property: resource.manager.logwhenfound => 'false'.
[INFO] [remote-resources:process {execution: default}]
[INFO] [site:attach-descriptor]
[INFO] [ianal:verify-legal-files {execution: default}]
[INFO] [install:install]
[INFO] Installing /home/geronimo/geronimo/2.2/testsuite/pom.xml to /home/geronimo/.m2/repository/org/apache/geronimo/testsuite/testsuite/2.2.2-SNAPSHOT/testsuite-2.2.2-SNAPSHOT.pom
[INFO] ------------------------------------------------------------------------
[INFO] Building Geronimo TestSuite :: Commands TestSuite
[INFO]    task-segment: [install]
[INFO] ------------------------------------------------------------------------
[INFO] [genesis:validate-configuration {execution: default}]
[INFO] snapshot org.apache.geronimo.testsupport:testsupport-commands:2.2.2-SNAPSHOT: checking
for updates from codehaus.snapshots
[INFO] snapshot org.apache.geronimo.testsupport:testsupport-commands:2.2.2-SNAPSHOT: checking
for updates from apache.snapshots
[INFO] snapshot org.apache.geronimo.framework:geronimo-deploy-jsr88:2.2.2-SNAPSHOT: checking
for updates from codehaus.snapshots
[INFO] snapshot org.apache.geronimo.framework:geronimo-deploy-jsr88:2.2.2-SNAPSHOT: checking
for updates from apache.snapshots
[INFO] snapshot org.apache.geronimo.framework:geronimo-system:2.2.2-SNAPSHOT: checking for
updates from codehaus.snapshots
[INFO] snapshot org.apache.geronimo.framework:geronimo-system:2.2.2-SNAPSHOT: checking for
updates from apache.snapshots
[INFO] snapshot org.apache.geronimo.framework:geronimo-cli:2.2.2-SNAPSHOT: checking for updates
from codehaus.snapshots
[INFO] snapshot org.apache.geronimo.framework:geronimo-cli:2.2.2-SNAPSHOT: checking for updates
from apache.snapshots
[INFO] snapshot org.apache.geronimo.framework:geronimo-kernel:2.2.2-SNAPSHOT: checking for
updates from codehaus.snapshots
[INFO] snapshot org.apache.geronimo.framework:geronimo-kernel:2.2.2-SNAPSHOT: checking for
updates from apache.snapshots
[INFO] snapshot org.apache.geronimo.framework:geronimo-crypto:2.2.2-SNAPSHOT: checking for
updates from codehaus.snapshots
[INFO] snapshot org.apache.geronimo.framework:geronimo-crypto:2.2.2-SNAPSHOT: checking for
updates from apache.snapshots
[INFO] snapshot org.apache.geronimo.framework:geronimo-common:2.2.2-SNAPSHOT: checking for
updates from codehaus.snapshots
[INFO] snapshot org.apache.geronimo.framework:geronimo-common:2.2.2-SNAPSHOT: checking for
updates from apache.snapshots
[INFO] snapshot org.apache.geronimo.framework:geronimo-plugin:2.2.2-SNAPSHOT: checking for
updates from codehaus.snapshots
[INFO] snapshot org.apache.geronimo.framework:geronimo-plugin:2.2.2-SNAPSHOT: checking for
updates from apache.snapshots
[INFO] snapshot org.apache.geronimo.framework:geronimo-deploy-config:2.2.2-SNAPSHOT: checking
for updates from codehaus.snapshots
[INFO] snapshot org.apache.geronimo.framework:geronimo-deploy-config:2.2.2-SNAPSHOT: checking
for updates from apache.snapshots
[INFO] [enforcer:enforce {execution: default}]
[INFO] [remote-resources:process {execution: default}]
[INFO] [site:attach-descriptor]
[INFO] [geronimo:start-server {execution: start}]
[INFO] Using assembly configuration: jetty
[INFO] snapshot org.apache.geronimo.assemblies:geronimo-jetty7-javaee5:2.2.2-SNAPSHOT: checking
for updates from codehaus.snapshots
[INFO] snapshot org.apache.geronimo.assemblies:geronimo-jetty7-javaee5:2.2.2-SNAPSHOT: checking
for updates from apache.snapshots
[INFO] Using assembly artifact: org.apache.geronimo.assemblies:geronimo-jetty7-javaee5:zip:bin:2.2.2-SNAPSHOT:provided
[INFO] Using geronimoHome: /home/geronimo/geronimo/2.2/testsuite/commands-testsuite/target/geronimo-jetty7-javaee5-2.2.2-SNAPSHOT
[INFO] Installing assembly...
[INFO] Expanding: /home/geronimo/.m2/repository/org/apache/geronimo/assemblies/geronimo-jetty7-javaee5/2.2.2-SNAPSHOT/geronimo-jetty7-javaee5-2.2.2-SNAPSHOT-bin.zip
into /home/geronimo/geronimo/2.2/testsuite/commands-testsuite/target
[INFO] Starting Geronimo server...
[INFO] Selected option set: default
[INFO] Redirecting output to: /home/geronimo/geronimo/2.2/testsuite/commands-testsuite/target/geronimo-logs/org.apache.geronimo.mavenplugins.geronimo.server.StartServerMojo.log
[INFO] Waiting for Geronimo server...
[INFO] ------------------------------------------------------------------------
[ERROR] BUILD ERROR
 
Samples: branches/2.2
=================================
Log: http://people.apache.org/builds/geronimo/server/binaries/2.2/20100820/samples-0800.log
 
Build status: FAILED
 

Mime
View raw message