geronimo-dev mailing list archives

Site index · List index
Message view « Date » · « Thread »
Top « Date » · « Thread »
From ga...@apache.org
Subject [BUILD] branches/2.2: Failed for Revision: 984875
Date Thu, 12 Aug 2010 18:14:06 GMT
Geronimo Revision: 984875 built with tests included
 
See the full build-1400.log file at http://people.apache.org/builds/geronimo/server/binaries/2.2/20100812/build-1400.log
 
 
See the unit test reports at http://people.apache.org/builds/geronimo/server/binaries/2.2/20100812/unit-test-reports
 
[INFO] snapshot org.apache.openejb:openejb-multicast:3.1.3-SNAPSHOT: checking for updates
from codehaus.snapshots
[INFO] snapshot org.apache.openejb:openejb-multicast:3.1.3-SNAPSHOT: checking for updates
from apache.snapshots
Downloading: http://repository.apache.org/snapshots/org/apache/openejb/openejb-multicast/3.1.3-SNAPSHOT/openejb-multicast-3.1.3-20100806.053716-33.pom
1K downloaded
Downloading: http://repository.apache.org/snapshots/org/apache/openejb/openejb-core/3.1.3-SNAPSHOT/openejb-core-3.1.3-20100806.053716-36.jar
1594K downloaded
Downloading: http://repository.apache.org/snapshots//org/apache/openejb/openejb-api/3.1.3-SNAPSHOT/openejb-api-3.1.3-20100806.053716-43.jar
8K downloaded
Downloading: http://repository.apache.org/snapshots/org/apache/openejb/openejb-loader/3.1.3-SNAPSHOT/openejb-loader-3.1.3-20100806.053716-43.jar
42K downloaded
Downloading: http://repository.apache.org/snapshots/org/apache/openejb/openejb-javaagent/3.1.3-SNAPSHOT/openejb-javaagent-3.1.3-20100806.053716-43.jar
12K downloaded
Downloading: http://repository.apache.org/snapshots/org/apache/openejb/openejb-jee/3.1.3-SNAPSHOT/openejb-jee-3.1.3-20100806.053716-42.jar
939K downloaded
Downloading: http://people.apache.org/repo/m2-incubating-repository/org/apache/commons/commons-math/2.1/commons-math-2.1.jar
Downloading: http://tomcat.apache.org/dev/dist/m2-repository/org/apache/commons/commons-math/2.1/commons-math-2.1.jar
Downloading: http://svn.apache.org/repos/asf/openejb/repo//org/apache/commons/commons-math/2.1/commons-math-2.1.jar
Downloading: http://download.java.net/maven/1//org.apache.commons/jars/commons-math-2.1.jar
Downloading: http://maven.rtp.raleigh.ibm.com/nexus-proxy//org/apache/commons/commons-math/2.1/commons-math-2.1.jar
812K downloaded
Downloading: http://people.apache.org/repo/m2-incubating-repository/org/apache/xbean/xbean-asm-shaded/3.7/xbean-asm-shaded-3.7.jar
Downloading: http://tomcat.apache.org/dev/dist/m2-repository/org/apache/xbean/xbean-asm-shaded/3.7/xbean-asm-shaded-3.7.jar
Downloading: http://svn.apache.org/repos/asf/openejb/repo//org/apache/xbean/xbean-asm-shaded/3.7/xbean-asm-shaded-3.7.jar
Downloading: http://download.java.net/maven/1//org.apache.xbean/jars/xbean-asm-shaded-3.7.jar
Downloading: http://maven.rtp.raleigh.ibm.com/nexus-proxy//org/apache/xbean/xbean-asm-shaded/3.7/xbean-asm-shaded-3.7.jar
118K downloaded
Downloading: http://people.apache.org/repo/m2-incubating-repository/org/codehaus/swizzle/swizzle-stream/1.0.1/swizzle-stream-1.0.1.jar
Downloading: http://tomcat.apache.org/dev/dist/m2-repository/org/codehaus/swizzle/swizzle-stream/1.0.1/swizzle-stream-1.0.1.jar
Downloading: http://svn.apache.org/repos/asf/openejb/repo//org/codehaus/swizzle/swizzle-stream/1.0.1/swizzle-stream-1.0.1.jar
Downloading: http://download.java.net/maven/1//org.codehaus.swizzle/jars/swizzle-stream-1.0.1.jar
Downloading: http://maven.rtp.raleigh.ibm.com/nexus-proxy//org/codehaus/swizzle/swizzle-stream/1.0.1/swizzle-stream-1.0.1.jar
42K downloaded
Downloading: http://people.apache.org/repo/m2-incubating-repository/quartz/quartz/1.5.2/quartz-1.5.2.jar
Downloading: http://tomcat.apache.org/dev/dist/m2-repository/quartz/quartz/1.5.2/quartz-1.5.2.jar
Downloading: http://svn.apache.org/repos/asf/openejb/repo//quartz/quartz/1.5.2/quartz-1.5.2.jar
Downloading: http://download.java.net/maven/1//quartz/jars/quartz-1.5.2.jar
Downloading: http://maven.rtp.raleigh.ibm.com/nexus-proxy//quartz/quartz/1.5.2/quartz-1.5.2.jar
379K downloaded
Downloading: http://repository.apache.org/snapshots/org/apache/openejb/openejb-ejbd/3.1.3-SNAPSHOT/openejb-ejbd-3.1.3-20100806.053716-33.jar
56K downloaded
Downloading: http://repository.apache.org/snapshots/org/apache/openejb/openejb-server/3.1.3-SNAPSHOT/openejb-server-3.1.3-20100806.053716-33.jar
83K downloaded
Downloading: http://repository.apache.org/snapshots/org/apache/openejb/openejb-client/3.1.3-SNAPSHOT/openejb-client-3.1.3-20100806.053716-33.jar
205K downloaded
Downloading: http://repository.apache.org/snapshots/org/apache/openejb/openejb-multicast/3.1.3-SNAPSHOT/openejb-multicast-3.1.3-20100806.053716-33.jar
48K downloaded
[INFO] [enforcer:enforce {execution: default}]
[INFO] [remote-resources:process {execution: default}]
[WARNING] org.apache.velocity.runtime.exception.ReferenceException: reference : template =
META-INF/DEPENDENCIES.vm [line 40,column 14] : $license.name is not a valid reference.
[WARNING] org.apache.velocity.runtime.exception.ReferenceException: reference : template =
META-INF/DEPENDENCIES.vm [line 40,column 14] : $license.name is not a valid reference.
[INFO] [resources:resources]
[INFO] Using 'UTF-8' encoding to copy filtered resources.
[INFO] Copying 1 resource
[INFO] skip non existing resourceDirectory /home/geronimo/geronimo/2.2/plugins/openejb/geronimo-openejb/src/main/filtered-resources
[INFO] Copying 3 resources
[INFO] [compiler:compile]
[INFO] Compiling 30 source files to /home/geronimo/geronimo/2.2/plugins/openejb/geronimo-openejb/target/classes
[INFO] ------------------------------------------------------------------------
[ERROR] BUILD FAILURE
[INFO] ------------------------------------------------------------------------
[INFO] Compilation failure

/home/geronimo/geronimo/2.2/plugins/openejb/geronimo-openejb/src/main/java/org/apache/geronimo/openejb/GeronimoSecurityService.java:[53,45]
[deprecation] login(java.lang.String,javax.security.auth.callback.CallbackHandler) in org.apache.geronimo.security.ContextManager
has been deprecated

/home/geronimo/geronimo/2.2/plugins/openejb/geronimo-openejb/src/main/java/org/apache/geronimo/openejb/GeronimoInboundRecovery.java:[51,30]
cannot find symbol
symbol  : method recoverResourceManager(org.apache.geronimo.transaction.manager.NamedXAResource)
location: interface org.apache.geronimo.transaction.manager.RecoverableTransactionManager


[INFO] ------------------------------------------------------------------------
[INFO] Trace
org.apache.maven.BuildFailureException: Compilation failure
	at org.apache.maven.lifecycle.DefaultLifecycleExecutor.executeGoals(DefaultLifecycleExecutor.java:580)
	at org.apache.maven.lifecycle.DefaultLifecycleExecutor.executeGoalWithLifecycle(DefaultLifecycleExecutor.java:500)
	at org.apache.maven.lifecycle.DefaultLifecycleExecutor.executeGoal(DefaultLifecycleExecutor.java:479)
	at org.apache.maven.lifecycle.DefaultLifecycleExecutor.executeGoalAndHandleFailures(DefaultLifecycleExecutor.java:331)
	at org.apache.maven.lifecycle.DefaultLifecycleExecutor.executeTaskSegments(DefaultLifecycleExecutor.java:292)
	at org.apache.maven.lifecycle.DefaultLifecycleExecutor.execute(DefaultLifecycleExecutor.java:142)
	at org.apache.maven.DefaultMaven.doExecute(DefaultMaven.java:336)
	at org.apache.maven.DefaultMaven.execute(DefaultMaven.java:129)
	at org.apache.maven.cli.MavenCli.main(MavenCli.java:301)
	at sun.reflect.NativeMethodAccessorImpl.invoke0(Native Method)
	at sun.reflect.NativeMethodAccessorImpl.invoke(NativeMethodAccessorImpl.java:39)
	at sun.reflect.DelegatingMethodAccessorImpl.invoke(DelegatingMethodAccessorImpl.java:25)
	at java.lang.reflect.Method.invoke(Method.java:585)
	at org.codehaus.classworlds.Launcher.launchEnhanced(Launcher.java:315)
	at org.codehaus.classworlds.Launcher.launch(Launcher.java:255)
	at org.codehaus.classworlds.Launcher.mainWithExitCode(Launcher.java:430)
	at org.codehaus.classworlds.Launcher.main(Launcher.java:375)
Caused by: org.apache.maven.plugin.CompilationFailureException: Compilation failure
	at org.apache.maven.plugin.AbstractCompilerMojo.execute(AbstractCompilerMojo.java:516)
	at org.apache.maven.plugin.CompilerMojo.execute(CompilerMojo.java:114)
	at org.apache.maven.plugin.DefaultPluginManager.executeMojo(DefaultPluginManager.java:453)
	at org.apache.maven.lifecycle.DefaultLifecycleExecutor.executeGoals(DefaultLifecycleExecutor.java:559)
	... 16 more
[INFO] ------------------------------------------------------------------------
[INFO] Total time: 17 minutes 49 seconds
[INFO] Finished at: Thu Aug 12 14:21:28 EDT 2010
[INFO] Final Memory: 258M/932M
[INFO] ------------------------------------------------------------------------

Mime
View raw message