geronimo-dev mailing list archives

Site index · List index
Message view « Date » · « Thread »
Top « Date » · « Thread »
From ga...@apache.org
Subject [BUILD] branches/2.2: Failed for Revision: 984384
Date Wed, 11 Aug 2010 14:54:54 GMT
Geronimo Revision: 984384 built with tests included
 
See the full build-0800.log file at http://people.apache.org/builds/geronimo/server/binaries/2.2/20100811/build-0800.log
 
Download the binaries from http://people.apache.org/builds/geronimo/server/binaries/2.2/20100811
[INFO] BUILD SUCCESSFUL
[INFO] ------------------------------------------------------------------------
[INFO] Total time: 41 minutes 44 seconds
[INFO] Finished at: Wed Aug 11 08:48:21 EDT 2010
[INFO] Final Memory: 346M/1010M
[INFO] ------------------------------------------------------------------------
 
TESTSUITE RESULTS (Failures only)
=================================
 
Assembly: tomcat
=================================
See full test results and logs at http://people.apache.org/builds/geronimo/server/binaries/2.2/20100811/logs-0800-tomcat/
 
[INFO] Running TestSuite
[INFO] Tests run: 40, Failures: 30, Errors: 0, Skipped: 0, Time elapsed: 180.579 sec <<<
FAILURE!
[INFO] Running TestSuite
[INFO] Tests run: 12, Failures: 11, Errors: 0, Skipped: 0, Time elapsed: 51.227 sec <<<
FAILURE!
--
[INFO] Running TestSuite
[INFO] Tests run: 7, Failures: 3, Errors: 0, Skipped: 0, Time elapsed: 114.122 sec <<<
FAILURE!
--
[INFO] Running TestSuite
[INFO] Tests run: 36, Failures: 1, Errors: 0, Skipped: 0, Time elapsed: 69.935 sec <<<
FAILURE!
 
Assembly: jetty
=================================
See full test results and logs at http://people.apache.org/builds/geronimo/server/binaries/2.2/20100811/logs-0800-jetty/
 
[INFO] Running TestSuite
[INFO] Tests run: 116, Failures: 3, Errors: 0, Skipped: 113, Time elapsed: 15.968 sec <<<
FAILURE!
[INFO] Running TestSuite
[INFO] Tests run: 12, Failures: 8, Errors: 0, Skipped: 0, Time elapsed: 83.215 sec <<<
FAILURE!
--
[INFO] Running TestSuite
[INFO] Tests run: 2, Failures: 2, Errors: 0, Skipped: 0, Time elapsed: 8.021 sec <<<
FAILURE!
[INFO] Running TestSuite
[INFO] Tests run: 7, Failures: 3, Errors: 0, Skipped: 0, Time elapsed: 66.986 sec <<<
FAILURE!
--
[INFO] Running TestSuite
[INFO] Tests run: 36, Failures: 1, Errors: 0, Skipped: 0, Time elapsed: 17.391 sec <<<
FAILURE!
--
[INFO] Running TestSuite
[INFO] Tests run: 10, Failures: 10, Errors: 0, Skipped: 0, Time elapsed: 0.696 sec <<<
FAILURE!
 
Samples: branches/2.2
=================================
Log: http://people.apache.org/builds/geronimo/server/binaries/2.2/20100811/samples-0800.log
 
Build status: FAILED
 

Mime
View raw message