geronimo-dev mailing list archives

Site index · List index
Message view « Date » · « Thread »
Top « Date » · « Thread »
From ga...@apache.org
Subject [BUILD] trunk: Failed for Revision: 984396
Date Wed, 11 Aug 2010 13:53:13 GMT
Geronimo Revision: 984396 built with tests included
 
See the full build-0900.log file at http://people.apache.org/builds/geronimo/server/binaries/trunk/20100811/build-0900.log
 
 
See the unit test reports at http://people.apache.org/builds/geronimo/server/binaries/trunk/20100811/unit-test-reports
 
[INFO] Installing /home/geronimo/geronimo/trunk/plugins/tomcat/tomcat7-clustering-builder-wadi/target/tomcat7-clustering-builder-wadi-3.0-SNAPSHOT.car
to /home/geronimo/.m2/repository/org/apache/geronimo/configs/tomcat7-clustering-builder-wadi/3.0-SNAPSHOT/tomcat7-clustering-builder-wadi-3.0-SNAPSHOT.car
[INFO] Installing /home/geronimo/geronimo/trunk/plugins/tomcat/tomcat7-clustering-builder-wadi/target/resources/META-INF/geronimo-plugin.xml
to /home/geronimo/.m2/repository/org/apache/geronimo/configs/tomcat7-clustering-builder-wadi/3.0-SNAPSHOT/tomcat7-clustering-builder-wadi-3.0-SNAPSHOT.plugin-metadata
[INFO] [car:update-pluginlist {execution: default-update-pluginlist}]
[INFO] ------------------------------------------------------------------------
[INFO] Building Geronimo Plugins, Aries
[INFO]    task-segment: [install]
[INFO] ------------------------------------------------------------------------
[INFO] [genesis:validate-configuration {execution: default}]
[INFO] [geronimo-property:set-property {execution: set-property}]
[INFO] [enforcer:enforce {execution: default}]
[INFO] [remote-resources:process {execution: default}]
[INFO] [site:attach-descriptor {execution: default-attach-descriptor}]
[INFO] [geronimo-osgi:verify-manifest {execution: verify-manifest}]
[INFO] [ianal:verify-legal-files {execution: default}]
[INFO] [install:install {execution: default-install}]
[INFO] Installing /home/geronimo/geronimo/trunk/plugins/aries/pom.xml to /home/geronimo/.m2/repository/org/apache/geronimo/plugins/aries/3.0-SNAPSHOT/aries-3.0-SNAPSHOT.pom
[INFO] ------------------------------------------------------------------------
[INFO] Building Geronimo Plugins, Aries :: Builder
[INFO]    task-segment: [install]
[INFO] ------------------------------------------------------------------------
[INFO] [genesis:validate-configuration {execution: default}]
[INFO] [geronimo-property:set-property {execution: set-property}]
[INFO] snapshot org.apache.aries.application:org.apache.aries.application.utils:0.2-incubating-SNAPSHOT:
checking for updates from local
[INFO] snapshot org.apache.aries.application:org.apache.aries.application.utils:0.2-incubating-SNAPSHOT:
checking for updates from jetty.oss.sonatype.org
[INFO] snapshot org.apache.aries.application:org.apache.aries.application.utils:0.2-incubating-SNAPSHOT:
checking for updates from openqa-snapshots
[INFO] snapshot org.apache.aries.application:org.apache.aries.application.utils:0.2-incubating-SNAPSHOT:
checking for updates from codehaus.snapshots
[INFO] snapshot org.apache.aries.application:org.apache.aries.application.utils:0.2-incubating-SNAPSHOT:
checking for updates from apache.snapshots
Downloading: http://repository.apache.org/snapshots/org/apache/aries/application/org.apache.aries.application.utils/0.2-incubating-SNAPSHOT/org.apache.aries.application.utils-0.2-incubating-20100811.011145-27.pom
3K downloaded  (org.apache.aries.application.utils-0.2-incubating-20100811.011145-27.pom)
[INFO] snapshot org.apache.aries.application:application:0.2-incubating-SNAPSHOT: checking
for updates from local
[INFO] snapshot org.apache.aries.application:application:0.2-incubating-SNAPSHOT: checking
for updates from jetty.oss.sonatype.org
[INFO] snapshot org.apache.aries.application:application:0.2-incubating-SNAPSHOT: checking
for updates from openqa-snapshots
[INFO] snapshot org.apache.aries.application:application:0.2-incubating-SNAPSHOT: checking
for updates from codehaus.snapshots
[INFO] snapshot org.apache.aries.application:application:0.2-incubating-SNAPSHOT: checking
for updates from apache.snapshots
Downloading: http://repository.apache.org/snapshots/org/apache/aries/application/application/0.2-incubating-SNAPSHOT/application-0.2-incubating-20100811.011145-27.pom
9K downloaded  (application-0.2-incubating-20100811.011145-27.pom)
[INFO] snapshot org.apache.aries.application:org.apache.aries.application.api:0.2-incubating-SNAPSHOT:
checking for updates from local
[INFO] snapshot org.apache.aries.application:org.apache.aries.application.api:0.2-incubating-SNAPSHOT:
checking for updates from jetty.oss.sonatype.org
[INFO] snapshot org.apache.aries.application:org.apache.aries.application.api:0.2-incubating-SNAPSHOT:
checking for updates from openqa-snapshots
[INFO] snapshot org.apache.aries.application:org.apache.aries.application.api:0.2-incubating-SNAPSHOT:
checking for updates from codehaus.snapshots
[INFO] snapshot org.apache.aries.application:org.apache.aries.application.api:0.2-incubating-SNAPSHOT:
checking for updates from apache.snapshots
Downloading: http://repository.apache.org/snapshots/org/apache/aries/application/org.apache.aries.application.api/0.2-incubating-SNAPSHOT/org.apache.aries.application.api-0.2-incubating-20100811.011145-27.pom
1K downloaded  (org.apache.aries.application.api-0.2-incubating-20100811.011145-27.pom)
Downloading: http://repository.apache.org/snapshots/org/apache/aries/application/org.apache.aries.application.utils/0.2-incubating-SNAPSHOT/org.apache.aries.application.utils-0.2-incubating-20100811.011145-27.jar
68K downloaded  (org.apache.aries.application.utils-0.2-incubating-20100811.011145-27.jar)
Downloading: http://repository.apache.org/snapshots/org/apache/aries/application/org.apache.aries.application.api/0.2-incubating-SNAPSHOT/org.apache.aries.application.api-0.2-incubating-20100811.011145-27.jar
26K downloaded  (org.apache.aries.application.api-0.2-incubating-20100811.011145-27.jar)
[INFO] [enforcer:enforce {execution: default}]
[INFO] [remote-resources:process {execution: default}]
[INFO] [resources:resources {execution: default-resources}]
[INFO] Using 'UTF-8' encoding to copy filtered resources.
[INFO] Copying 2 resources
[INFO] skip non existing resourceDirectory /home/geronimo/geronimo/trunk/plugins/aries/geronimo-aries-builder/src/main/filtered-resources
[INFO] Copying 3 resources
[INFO] [compiler:compile {execution: default-compile}]
[INFO] Compiling 7 source files to /home/geronimo/geronimo/trunk/plugins/aries/geronimo-aries-builder/target/classes
[INFO] ------------------------------------------------------------------------
[ERROR] BUILD FAILURE
[INFO] ------------------------------------------------------------------------
[INFO] Compilation failure

/home/geronimo/geronimo/trunk/plugins/aries/geronimo-aries-builder/src/main/java/org/apache/geronimo/aries/builder/GeronimoApplication.java:[52,46]
[deprecation] createDeploymentMetadata(java.io.InputStream) in org.apache.aries.application.DeploymentMetadataFactory
has been deprecated

/home/geronimo/geronimo/trunk/plugins/aries/geronimo-aries-builder/src/main/java/org/apache/geronimo/aries/builder/GeronimoApplication.java:[63,31]
cannot find symbol
symbol  : constructor SimpleBundleInfo(org.apache.aries.application.ApplicationMetadataFactory,org.apache.aries.application.utils.manifest.BundleManifest,java.lang.String)
location: class org.apache.aries.application.utils.management.SimpleBundleInfo


[INFO] ------------------------------------------------------------------------
[INFO] Trace
org.apache.maven.BuildFailureException: Compilation failure
	at org.apache.maven.lifecycle.DefaultLifecycleExecutor.executeGoals(DefaultLifecycleExecutor.java:715)
	at org.apache.maven.lifecycle.DefaultLifecycleExecutor.executeGoalWithLifecycle(DefaultLifecycleExecutor.java:556)
	at org.apache.maven.lifecycle.DefaultLifecycleExecutor.executeGoal(DefaultLifecycleExecutor.java:535)
	at org.apache.maven.lifecycle.DefaultLifecycleExecutor.executeGoalAndHandleFailures(DefaultLifecycleExecutor.java:387)
	at org.apache.maven.lifecycle.DefaultLifecycleExecutor.executeTaskSegments(DefaultLifecycleExecutor.java:348)
	at org.apache.maven.lifecycle.DefaultLifecycleExecutor.execute(DefaultLifecycleExecutor.java:180)
	at org.apache.maven.DefaultMaven.doExecute(DefaultMaven.java:328)
	at org.apache.maven.DefaultMaven.execute(DefaultMaven.java:138)
	at org.apache.maven.cli.MavenCli.main(MavenCli.java:362)
	at org.apache.maven.cli.compat.CompatibleMain.main(CompatibleMain.java:60)
	at sun.reflect.NativeMethodAccessorImpl.invoke0(Native Method)
	at sun.reflect.NativeMethodAccessorImpl.invoke(NativeMethodAccessorImpl.java:39)
	at sun.reflect.DelegatingMethodAccessorImpl.invoke(DelegatingMethodAccessorImpl.java:25)
	at java.lang.reflect.Method.invoke(Method.java:597)
	at org.codehaus.classworlds.Launcher.launchEnhanced(Launcher.java:315)
	at org.codehaus.classworlds.Launcher.launch(Launcher.java:255)
	at org.codehaus.classworlds.Launcher.mainWithExitCode(Launcher.java:430)
	at org.codehaus.classworlds.Launcher.main(Launcher.java:375)
Caused by: org.apache.maven.plugin.CompilationFailureException: Compilation failure
	at org.apache.maven.plugin.AbstractCompilerMojo.execute(AbstractCompilerMojo.java:516)
	at org.apache.maven.plugin.CompilerMojo.execute(CompilerMojo.java:114)
	at org.apache.maven.plugin.DefaultPluginManager.executeMojo(DefaultPluginManager.java:490)
	at org.apache.maven.lifecycle.DefaultLifecycleExecutor.executeGoals(DefaultLifecycleExecutor.java:694)
	... 17 more
[INFO] ------------------------------------------------------------------------
[INFO] Total time: 39 minutes 12 seconds
[INFO] Finished at: Wed Aug 11 09:40:26 EDT 2010
[INFO] Final Memory: 455M/983M
[INFO] ------------------------------------------------------------------------

Mime
View raw message