geronimo-dev mailing list archives

Site index · List index
Message view « Date » · « Thread »
Top « Date » · « Thread »
From ga...@apache.org
Subject [BUILD] branches/2.2: Failed for Revision: 984267
Date Wed, 11 Aug 2010 08:57:19 GMT
Geronimo Revision: 984267 built with tests included
 
See the full build-2000.log file at http://people.apache.org/builds/geronimo/server/binaries/2.2/20100811/build-2000.log
 
Download the binaries from http://people.apache.org/builds/geronimo/server/binaries/2.2/20100811
[INFO] BUILD SUCCESSFUL
[INFO] ------------------------------------------------------------------------
[INFO] Total time: 395 minutes 11 seconds
[INFO] Finished at: Wed Aug 11 02:41:27 EDT 2010
[INFO] Final Memory: 326M/839M
[INFO] ------------------------------------------------------------------------
 
TESTSUITE RESULTS (Failures only)
=================================
 
Assembly: tomcat
=================================
See full test results and logs at http://people.apache.org/builds/geronimo/server/binaries/2.2/20100811/logs-2000-tomcat/
 
[INFO] Running TestSuite
[INFO] Tests run: 40, Failures: 33, Errors: 0, Skipped: 0, Time elapsed: 174.793 sec <<<
FAILURE!
[INFO] Running TestSuite
[INFO] Tests run: 12, Failures: 10, Errors: 0, Skipped: 0, Time elapsed: 55.402 sec <<<
FAILURE!
--
[INFO] Running TestSuite
[INFO] Tests run: 7, Failures: 3, Errors: 0, Skipped: 0, Time elapsed: 107.916 sec <<<
FAILURE!
--
[INFO] Running TestSuite
[INFO] Tests run: 36, Failures: 1, Errors: 0, Skipped: 0, Time elapsed: 69.368 sec <<<
FAILURE!
--
[INFO] Running TestSuite
[INFO] Tests run: 10, Failures: 10, Errors: 0, Skipped: 0, Time elapsed: 0.626 sec <<<
FAILURE!
 
Assembly: jetty
=================================
See full test results and logs at http://people.apache.org/builds/geronimo/server/binaries/2.2/20100811/logs-2000-jetty/
 
[INFO] Running TestSuite
[INFO] Tests run: 116, Failures: 3, Errors: 0, Skipped: 113, Time elapsed: 16.014 sec <<<
FAILURE!
[INFO] Running TestSuite
[INFO] Tests run: 12, Failures: 9, Errors: 0, Skipped: 0, Time elapsed: 63.599 sec <<<
FAILURE!
--
[INFO] Running TestSuite
[INFO] Tests run: 2, Failures: 2, Errors: 0, Skipped: 0, Time elapsed: 8.042 sec <<<
FAILURE!
[INFO] Running TestSuite
[INFO] Tests run: 7, Failures: 3, Errors: 0, Skipped: 0, Time elapsed: 92.537 sec <<<
FAILURE!
--
[INFO] Running TestSuite
[INFO] Tests run: 36, Failures: 1, Errors: 0, Skipped: 0, Time elapsed: 17.631 sec <<<
FAILURE!
--
[INFO] Running TestSuite
[INFO] Tests run: 10, Failures: 10, Errors: 0, Skipped: 0, Time elapsed: 0.649 sec <<<
FAILURE!
 
Samples: branches/2.2
=================================
Log: http://people.apache.org/builds/geronimo/server/binaries/2.2/20100811/samples-2000.log
 
Build status: FAILED
 

Mime
View raw message