geronimo-dev mailing list archives

Site index · List index
Message view « Date » · « Thread »
Top « Date » · « Thread »
From ga...@apache.org
Subject [BUILD] branches/2.2: Failed for Revision: 984146
Date Tue, 10 Aug 2010 20:54:31 GMT
Geronimo Revision: 984146 built with tests included
 
See the full build-1400.log file at http://people.apache.org/builds/geronimo/server/binaries/2.2/20100810/build-1400.log
 
Download the binaries from http://people.apache.org/builds/geronimo/server/binaries/2.2/20100810
[INFO] BUILD SUCCESSFUL
[INFO] ------------------------------------------------------------------------
[INFO] Total time: 38 minutes 29 seconds
[INFO] Finished at: Tue Aug 10 14:45:06 EDT 2010
[INFO] Final Memory: 344M/1013M
[INFO] ------------------------------------------------------------------------
 
TESTSUITE RESULTS (Failures only)
=================================
 
Assembly: tomcat
=================================
See full test results and logs at http://people.apache.org/builds/geronimo/server/binaries/2.2/20100810/logs-1400-tomcat/
 
[INFO] Running TestSuite
[INFO] Tests run: 40, Failures: 33, Errors: 0, Skipped: 0, Time elapsed: 175.49 sec <<<
FAILURE!
[INFO] Running TestSuite
[INFO] Tests run: 12, Failures: 9, Errors: 0, Skipped: 0, Time elapsed: 61.802 sec <<<
FAILURE!
--
[INFO] Running TestSuite
[INFO] Tests run: 7, Failures: 3, Errors: 0, Skipped: 0, Time elapsed: 84.357 sec <<<
FAILURE!
--
[INFO] Running TestSuite
[INFO] Tests run: 36, Failures: 1, Errors: 0, Skipped: 0, Time elapsed: 69.544 sec <<<
FAILURE!
--
[INFO] Running TestSuite
[INFO] Tests run: 10, Failures: 10, Errors: 0, Skipped: 0, Time elapsed: 0.656 sec <<<
FAILURE!
 
Assembly: jetty
=================================
See full test results and logs at http://people.apache.org/builds/geronimo/server/binaries/2.2/20100810/logs-1400-jetty/
 
[INFO] Running TestSuite
[INFO] Tests run: 116, Failures: 3, Errors: 0, Skipped: 113, Time elapsed: 15.864 sec <<<
FAILURE!
[INFO] Running TestSuite
[INFO] Tests run: 12, Failures: 10, Errors: 0, Skipped: 0, Time elapsed: 59.169 sec <<<
FAILURE!
--
[INFO] Running TestSuite
[INFO] Tests run: 2, Failures: 2, Errors: 0, Skipped: 0, Time elapsed: 7.826 sec <<<
FAILURE!
[INFO] Running TestSuite
[INFO] Tests run: 7, Failures: 3, Errors: 0, Skipped: 0, Time elapsed: 97.776 sec <<<
FAILURE!
--
[INFO] Running TestSuite
[INFO] Tests run: 10, Failures: 10, Errors: 0, Skipped: 0, Time elapsed: 0.85 sec <<<
FAILURE!
 
Samples: branches/2.2
=================================
Log: http://people.apache.org/builds/geronimo/server/binaries/2.2/20100810/samples-1400.log
 
Build status: FAILED
 

Mime
View raw message